Ablagerung
type: Concept
type: NamedIndividual
created: 2019-06-19T11:08:10
modified: 2021-01-30T16:22:17
alternative label: dépôt superficiel @fr
alternative label: surface deposit @en
alternative label: oberflächliche Ablagerung
alternative label: povrchové usazeniny @cs
broader: Natursteinschaden
definition: Accumulation of exogenic material of variable thickness. Some examples of deposits : splashes of paint or mortar, sea salt aerosols, atmospheric particles such as soot or dust, remains of conservation materials such as cellulose poultices, blast materials etc... [ICOMOS-ISCS] @en
definition: Accumulation superficielle de matériaux exogènes formant une couche peu cohérente et d’épaisseur variable. Exemples de dépôts : éclaboussures de peinture ou de mortier, sels provenant d’aérosols marins, poussières, restes de matériaux de conservation comme compresses cellulosiques, poudres de sablage etc. [ICOMOS-ISCS] @fr
definition: Ansammlung von exogenem Material variabler Dicke. Einige Beispiele von Ablagerungen: Farbspritzer oder Mörtelspritzer, Aerosole von Meersalz, atmosphärische Partikel wie Ruß oder Staub, Rückstände von Konservierungsstoffen wie Zellulosekompressen, Strahlgut etc. [ICOMOS-ISCS]
definition: Depozit je akumulace exogenního materiálu proměnlivé tloušťky. několik příkladů usazenin: rozstříknutá barva nebo malta, aerosoly z mořských solí, atmosferické částice jako jsou saze nebo prach, zbytky materiálů, užívaných při konzervačním zásahu, jako jsou částice celulózy, pískovací materiál atd... [ICOMOS-ISCS] @cs
in scheme: Bamberger Vokabular für Historische Architektur
in scheme: Begriffe für Naturstein- und Wandmalereirestaurierung
in scheme: Begriffe für Bauerhalt
in scheme: Quellennachweis ICOMOS-ISCS
preferred label: depozit @cs
preferred label: deposit @en
preferred label: dépôt @fr

Natursteinschaden
type: NamedIndividual
type: Concept
narrower: Ablagerung

Begriffe für Bauerhalt
type: NamedIndividual
type: ConceptScheme

Quellennachweis ICOMOS-ISCS
type: NamedIndividual
type: ConceptScheme

Bamberger Vokabular für Historische Architektur
type: NamedIndividual
type: ConceptScheme

Begriffe für Naturstein- und Wandmalereirestaurierung
type: NamedIndividual
type: ConceptScheme