Schießerker
type: NamedIndividual
type: Concept
narrower: Pechnase
preferred label: salidizo de tiro @es
preferred label: bertesca @it

Pechnase
type: Concept
type: NamedIndividual
created: 2020-06-15T16:00:50
modified: 2021-01-27T14:32:52
alternative label: naso @it
alternative label: Gusserker
alternative label: bretèche @fr
alternative label: piknůsek @cs
alternative label: bertesca @it
alternative label: cadoia @it
alternative label: matacán @es
broader: Schießerker
definition: Nach unten offener Erker an der Außenseite einer Wehrmauer zum Hinabgießen von heißem Öl, Pech o. ä. [Koch 2009]
definition: Kleiner, erkerartiger Vorbau mit Bodenöffnung an den Außenseiten von Burg- oder Stadtmauern, an Torbauten, selten an Wohnbauten und an Bergfrieden, wie bei Gusslöchern (Wurfscharten) zum Ausgießen von heißen Flüssigkeiten (Wasser, Öl, Pech, Teer) gegen angreifende Feinde. Häufig werden Abtritte mit P.n verwechselt, deren Einbauten und Bodenöffnung aber ihre Nutzung erkennen lassen. Die P. ist wahrscheinl. vom Orient über Südfrankreich im 13. Jh. allg. in Europa verbreitet worden. Die frz. Wehrbauten bevorzugten eme fortlaufende und zusammenhängende Anordnung als vorspringende Galerie auf Konsolen (Maschikuli). [Koepf/Binding 2016]
definition: Licí arkýř ve středověkém hradu. [Koch 2008] @cs
in scheme: Strukturtypen für Burgen und Schlösser
in scheme: Quellennachweis Koch 2008
in scheme: Bamberger Vokabular für Historische Architektur
in scheme: Strukturtypen
in scheme: Quellennachweis Koch 2009
preferred label: piombatoia @it
preferred label: podsebití @cs
preferred label: mâchicoulis @fr
preferred label: machicolation @en

Quellennachweis Koch 2008
type: NamedIndividual
type: ConceptScheme

Strukturtypen für Burgen und Schlösser
type: NamedIndividual
type: ConceptScheme

Bamberger Vokabular für Historische Architektur
type: NamedIndividual
type: ConceptScheme

Quellennachweis Koch 2009
type: NamedIndividual
type: ConceptScheme

Strukturtypen
type: NamedIndividual
type: ConceptScheme