Stahlbetonbauelement
type: NamedIndividual
type: Concept
narrower: Bewehrung
preferred label: železobeton @cs

Bewehrung
type: NamedIndividual
type: Concept
created: 2020-08-28T10:59:11
modified: 2021-01-22T17:22:31
alternative label: Armierung
broader: Stahlbetonbauelement
definition: Die Armierung des Stahlbetons durch Eiseneinlagen. Man unterscheidet sog. schlaffe B. beim normal auf Biegung beanspruchten Stahlbeton, vorgespannte B. beim Spannbeton und Druckb. bei Stützen. [Koepf / Binding 2016]
definition: Armierung, die Bewehrung des Stahlbetons durch Eiseneinlagen nach stat. Berechnung. [Koepf / Binding 2016]
in scheme: Strukturtypen
in scheme: Bamberger Vokabular für Historische Architektur
preferred label: zesílení @cs

Bamberger Vokabular für Historische Architektur
type: NamedIndividual
type: ConceptScheme

Strukturtypen
type: NamedIndividual
type: ConceptScheme