Dachaufbauten
type: NamedIndividual
type: Concept
narrower: Attika

Wand
type: NamedIndividual
type: Concept
narrower: Attika
preferred label: stěna @cs
preferred label: partition @en
preferred label: paroi @fr
preferred label: parete @it
preferred label: pared @es

Attika
type: NamedIndividual
type: Concept
created: 2020-07-27T09:34:48
modified: 2021-01-22T19:38:04
broader: Dachaufbauten
broader: Wand
definition: 1. Niedrige Wand über dem Hauptgesims eines Gebäudes, mit der das Dach verdeckt werden soll, oft mit Figuren bekrönt; 2. im Innenraum die schmale Wandfläche, die zwischen zwei Gesimsen verläuft und sich so zwischen das (meist Tonnen-) Gewölbe und die Stützen schiebt. Antike, Renaissance, Barock, Klassizismus. Attikageschoss heißt ein niedriges Geschoss über dem Hauptgesims, besonders italienische Spätrenaissance und frz. Barock. [Koch 2009]
definition: 1. Nízká zeď nad hlavní - římsou budovy, která má zakrývat střechu, často zakončená figurami. 2. V interiéru úzká stěna probíhající mezi dvěma římsami a vsunutá tak mezi (většinou valenou) klenbu a podpory, antika, renesance, baroko, klasicismus. [Koch 2008] @cs
definition: Attika (lat. att., athen.), niedriger Aufbau über dem Hauptgesims eines Bauwerks, meist mit einem nach oben abschließenden Gesims versehen. Die A. kommt in der Antike bes. an röm. Stadttoren und Triumphbogen vor, wo sie zur Anbringung von Inschriften und als Sockel für freiplast. Bildwerke diente. Seit der Renaissance verwendete man sie an Kirchen und Profanbauten vielfach zum Verdecken des Dachansatzes, während das Barock ein niedriges Obergeschoss, das A.geschoss, entwickelte. Im Klassizismus fehlt gewöhnl. das Abschlussgesims der A. [Koepf / Binding 2016]
definition: Die sich oberhalb des Kranz- oder Hauptgesimses eines Gebäudes noch anschließende Zone in Form eines Mauerstreifens oder eines niedrigen Geschosses erhebt. Sie kommt zwar schon an griechischen Bauten vor, wird aber erst an römischen Torbauten und Triumphbögen beispielhaft entwickelt. Die mittelalterliche Architektur kennt mit wenigen Ausnahmen in der Toskana keine A. Die profane Baukunst der Spätgotik entwickelt eine Sonderform, in der Zinnen oder Halbkreisbögen einen horizontalen Gebäudeabschluss bilden und das Dach versteckt wird (Gürzenich/Köln NW). In der Barockzeit kann die A. in Form einer Balusterreihe (Residenz/Würzburg BY) ausgebildet oder als Halbgeschoss durchfenstert sein – mit aufgesetzten Skulpturen. Der Klassizismus bevorzugt wieder mehr die schwere, geschlossene Form (Projekt Nationalbibliothek von E. Boullée, 1785). B. Sch.-W. [Wörterbuch der Burgen, Schlösser und Festungen]
in scheme: Strukturtypen
in scheme: Quellennachweis Koch 2008
in scheme: Quellennachweis Wörterbuch der Burgen, Schlösser und Festungen
in scheme: Quellennachweis Koch 2009
in scheme: Quellennachweis Koepf / Binding 2016
in scheme: Bamberger Vokabular für Historische Architektur
preferred label: atika @cs

Quellennachweis Wörterbuch der Burgen, Schlösser und Festungen
type: NamedIndividual
type: ConceptScheme

Quellennachweis Koch 2008
type: NamedIndividual
type: ConceptScheme

Bamberger Vokabular für Historische Architektur
type: NamedIndividual
type: ConceptScheme

Quellennachweis Koepf / Binding 2016
type: NamedIndividual
type: ConceptScheme

Quellennachweis Koch 2009
type: NamedIndividual
type: ConceptScheme

Strukturtypen
type: NamedIndividual
type: ConceptScheme