Erosion
type: NamedIndividual
type: Concept
narrower: Abrundung
preferred label: érosion @fr
preferred label: eroze @cs
preferred label: erosion @en

Abrundung
type: Concept
type: NamedIndividual
created: 2019-05-14T12:31:36
modified: 2021-01-30T16:41:50
alternative label: Zurundung
broader: Erosion
definition: forme arrondie résultant de l’érosionpréférentielle des bords originellement anguleux d’une pierre.On observe cette forme d’altération sur les pierres sujettes àla désagrégation granulaire, ou placées dans des conditionstelles que la désagrégation granulaire peut se développer. [ICOMOS-ISCS] @fr
definition: přednostní eroze původně ostrohranného kamene vedoucí k výrazně zakulacenému profilu. Zakulacení může být obzvláště pozorováno na kamenech, které přednostně chátrají v důsledku zrnitého rozpadu, nebo když jsou podmínky prostředí pro zrnitý rozpad příznivé. [ICOMOS-ISCS] @cs
definition: Bevorzugte Erosion von ursprünglich scharfen Kanten und Ecken zu einem gerundeten Profil. Zurundung wird besonders bei Gesteinen beobachtet, die durch „Körnigen Zerfall“ verwittern, oder wenn die Umgebungsbedingungen den „Körnigen Zerfall“ fördern. [ICOMOS-ISCS]
definition: Preferential erosion of originally angular stoneedges leading to a distinctly rounded profile. Rounding canespecially be observed on stones which preferably deterioratethrough granular disintegration, or when environmentalconditions favor granular disintegration. [ICOMOS-ISCS] @en
in scheme: Bamberger Vokabular für Historische Architektur
in scheme: Quellennachweis ICOMOS-ISCS
in scheme: Begriffe für Bauerhalt
in scheme: Begriffe für Naturstein- und Wandmalereirestaurierung
preferred label: zakulacení @cs
preferred label: erosion en boule @fr
preferred label: rounding @en

Begriffe für Bauerhalt
type: NamedIndividual
type: ConceptScheme

Quellennachweis ICOMOS-ISCS
type: NamedIndividual
type: ConceptScheme

Bamberger Vokabular für Historische Architektur
type: NamedIndividual
type: ConceptScheme

Begriffe für Naturstein- und Wandmalereirestaurierung
type: NamedIndividual
type: ConceptScheme