Syrischer Architrav
type: NamedIndividual
type: Concept
broader: Architrav
preferred label: syrský architráv @cs

Taenia
type: NamedIndividual
type: Concept
broader: Architrav
preferred label: taenia @cs

Architrav
type: NamedIndividual
type: Concept
created: 2020-08-03T12:20:39
modified: 2020-09-02T11:28:53
alternative label: Epistyl
broader: Gebälkelement
definition: Architrav (gr. archi-: Ober-, Haupt-, und lat. trabs: Balken), in der antiken Baukunst und den von ihr beeinflussten Baustilen der waagerechte, den Oberbau tragende Hauptbalken; da er beim gr. Tempel meist auf Säulen ruht, auch Epistyl (gr. auf den Säulen liegend) genannt (Säulenordnungen). Der steinerne A„ von einer Säulenachse zur anderen in Blöcke unterteilt, ist in der Dorischen Ordnung glatt und hat oben eine Abschlussleiste (lat. taenie: Band), an der unterhalb kleine Leisten (regulae) mit >Tropfen< (guttae) angebracht sind. Im ion. und korinth. Stil ist der A. durch zwei oder drei übereinanderliegende, horizontale Streifen (jasciae) von gleicher oder verschiedender Breite gegliedert und mit einer mehrfach unterteilten Leistenbekrönung versehen - beides eine Erinnerung an die übereinanderliegenden Balken des Holzbaus (Gebälk). [Koepf / Binding 2016]
definition: Trám položený vodorovně na sloupech v antické architektuře a ve stavebních slozích z ní vycházejících. [Koch 2008] @cs
definition: Architrav (griech. epistylion), der waagerecht auf den Säulen aufliegende Balken in der antiken Baukunst und in den von ihr abhängigen Baustilen. [Koch 2009]
in scheme: Quellennachweis Koch 2009
in scheme: Quellennachweis Koepf / Binding 2016
in scheme: Strukturtypen
in scheme: Bamberger Vokabular für Historische Architektur
in scheme: Quellennachweis Koch 2008
narrower: Taenia
narrower: Syrischer Architrav
preferred label: architráv @cs

Gebälkelement
type: NamedIndividual
type: Concept
narrower: Architrav

Quellennachweis Koch 2008
type: NamedIndividual
type: ConceptScheme

Bamberger Vokabular für Historische Architektur
type: NamedIndividual
type: ConceptScheme

Quellennachweis Koepf / Binding 2016
type: NamedIndividual
type: ConceptScheme

Quellennachweis Koch 2009
type: NamedIndividual
type: ConceptScheme

Strukturtypen
type: NamedIndividual
type: ConceptScheme