mechanischer Schaden
type: NamedIndividual
type: Concept
narrower: Schnitt (Schaden)
preferred label: mechanické poškození @cs
preferred label: mechanical damage @en
preferred label: dégât mécanique @fr

Schnitt (Schaden)
type: NamedIndividual
type: Concept
created: 2019-05-20T16:25:34
modified: 2021-01-30T17:30:13
alternative label: Einschnitt
broader: mechanischer Schaden
definition: Marque laissée par l’élimination de matière à l’aide d’un instrument coupant. Une incision peut avoir l’apparence d’une cavité excavée, une coupure, un bord manquant, etc. Les marques d’outil peuvent être considérées comme des formes spéciales d’incisions, mais ne devraient pas être considérées comme des formes d’altération. Certains graffitis peuvent être faits par incision de la pierre. [ICOMOS-ISCS] @fr
definition: Loss of material due to the action of an edge tool. Itcan have the appearance of an excavated cavity, an incision,a missing edge, etc...Tool marks can be considered as specialkinds of cuts but should not be considered as damage features. [ICOMOS-ISCS] @en
definition: ztráta materiálu způsobená ostrým nástrojem, může mít vzhled vyhloubené dutiny, zářezu, odseknutého rohu, atd. Stopa nástrojů může být považována za zvláštní druh řezů, ale neměla by být považována za známku poškození. [ICOMOS-ISCS] @cs
definition: Verlust von Steinmaterial durch ein scharfkantiges Werkzeug. Ein Einschnitt kann die Form einer ausgearbeiteten Aushöhlung, einer Einritzung, einer fehlenden Kante etc. haben. Werkzeugspuren können als eine besondere Form von Einschnitten angesehen werden, sollten aber nicht zu den Schäden gezählt werden. [ICOMOS-ISCS]
in scheme: Begriffe für Bauerhalt
in scheme: Begriffe für Naturstein- und Wandmalereirestaurierung
in scheme: Bamberger Vokabular für Historische Architektur
in scheme: Quellennachweis ICOMOS-ISCS
in scheme: Begriffe für den Themenkomplex Sakralbau
preferred label: zářez @cs
preferred label: incision @fr
preferred label: cut @en

Begriffe für Bauerhalt
type: NamedIndividual
type: ConceptScheme

Quellennachweis ICOMOS-ISCS
type: NamedIndividual
type: ConceptScheme

Begriffe für den Themenkomplex Sakralbau
type: NamedIndividual
type: ConceptScheme

Bamberger Vokabular für Historische Architektur
type: NamedIndividual
type: ConceptScheme

Begriffe für Naturstein- und Wandmalereirestaurierung
type: NamedIndividual
type: ConceptScheme