Wehr- und Schutzanlage
type: NamedIndividual
type: Concept
narrower: Zeughaus
preferred label: opevnění @cs

Zeughaus
type: Concept
type: NamedIndividual
created: 2020-04-22T16:37:43
modified: 2021-01-27T12:56:17
alternative label: Armamentarium
alternative label: armoury @en
broader: Wehr- und Schutzanlage
definition: Arsenal, Gebäude, das dem Waffenlager einer Stadt dient. [Koepf / Binding 2016]
definition: Ein zur Lagerung von Waffen (»Zeug« = Geschütz), Munition und Kriegsgerät aller Art dienendes Gebäude; Bauaufgabe der (Frühen) Neuzeit bis zum 19. Jh. Eines der bedeutendsten frühen Beispiele war das 1563 in Dresden errichtete Z., doch bereits zu Beginn des 16. Jh.s bestanden kaiserliche Z.er in Innsbruck A und Lindau BY. In der 2. Hälfte des 17. Jh.s wandelten sich die Z.er mancherorts zu Magazinen der neu aufkommenden stehenden (Söldner-)Heere. Durch die Aufgabenerweiterung der Z.er (Produktion und Wartung von Militärtechnik) entstanden die Arsenale. Wenn sich auch die Aufgaben zunehmend wandelten und mehrten, blieb der Begriff Z. doch in der bis ins 19. und 20. Jh. u. a. in Sachsen, Preußen und Bayern bestehenden Feldzeugmeisterei erhalten. Nicht überall entstanden eigene Z.-Bauten: in Valletta, der Hauptstadt des Johanniter-/Malteser-Ordensstaates, war das Z. (Palace Armoury) im piano nobile des Palastes des Ordensgroßmeisters untergebracht. Anderenorts waren Z.er in die Verteidigungsanlagen einbezogen (Bundesfestung Germersheim RP: defensibles Z., vor 1846). M. L. [Wörterbuch der Burgen, Schlösser und Festungen]
in scheme: Bamberger Vokabular für Historische Architektur
in scheme: Quellennachweis Wörterbuch der Burgen, Schlösser und Festungen
in scheme: Strukturtypen für Wohn- und Nutzbauten
in scheme: Strukturtypen
preferred label: arsenal @fr
preferred label: arsenale @it
preferred label: armory @en-us
preferred label: zbrojnice @cs

Quellennachweis Wörterbuch der Burgen, Schlösser und Festungen
type: NamedIndividual
type: ConceptScheme

Bamberger Vokabular für Historische Architektur
type: NamedIndividual
type: ConceptScheme

Strukturtypen für Wohn- und Nutzbauten
type: NamedIndividual
type: ConceptScheme

Strukturtypen
type: NamedIndividual
type: ConceptScheme