Zimmer
type: NamedIndividual
type: Concept
narrower: Paradezimmer
preferred label: pokoj @cs

Paradezimmer
type: NamedIndividual
type: Concept
created: 2020-06-15T16:18:14
modified: 2021-01-21T19:00:53
alternative label: parádní pokoj @cs
broader: Zimmer
definition: Das Paradezimmer, befindet sich im Paradeappartement (Appartement) eines Schlosses und nimmt das Paradebett auf, das im Allgemeinen nicht zum Schlafen dient, sondern zum Repräsentieren. Der Schlossherr empfängt hier besonders ausgewählte Gäste, die nicht im Audienzgemach bleiben müssen ( Zeremoniell). H. L. [Wörterbuch der Burgen, Schlösser und Festungen]
definition: Im Hauptteil eines Schlosses oder im Hauptgeschoss eines herrschaftl. Hauses gelegene Zimmer, die reich ausgestaltet sind und aus Audienz-, Gesellschaftszimmern und Sälen bestehen. [Koepf/Binding 2016]
in scheme: Bamberger Vokabular für Historische Architektur
in scheme: Strukturtypen
preferred label: stanze di rappresentanza @it
preferred label: reprezentační pokoj @cs
preferred label: salón de gala @es
broader by function: Zimmer

Bamberger Vokabular für Historische Architektur
type: NamedIndividual
type: ConceptScheme

Strukturtypen
type: NamedIndividual
type: ConceptScheme