Bogenform
type: NamedIndividual
type: Concept
narrower: Segmentbogen

Segmentbogen
type: Concept
type: NamedIndividual
created: 2019-02-18T20:11:23
modified: 2021-01-15T17:39:51
alternative label: plochý klenutý oblouk @cs
alternative label: arco rebajado @es
alternative label: Stichbogen
alternative label: arc aplati @fr
alternative label: arc segmentaire @fr
alternative label: Flachbogen
alternative label: arc bombé @fr
alternative label: diminished arch @en
broader: Bogenform
definition: Bogen mit einer sehr flachen Bogenlinie, oft mit besonderer Ausbildung des Bogenanfalls. Der Mittelpunkt des Kreisbogens liegt unterhalb der Kämpferlinie. Die Bogenlinie trifft an den Kämpferpunkten im stumpfen Winkel auf die senkrechten Stützen. Der Stich beträgt im allgemeinen 1/6–1/12 der Spannweite. [Glossarium Artis]
definition: Flachbogen, Stichbogen; eine Bogenform, deren Kontur von einem Kreissegment gebildet wird. Der Kreisausschnitt ist kleiner als beim Halbkreisbogen (Rundbogen), bei relativ großem Kreisdurchmesser und relativ kleinem Ausschnitt nähert er sich dem Scheitrechten Sturz. [Koepf / Binding 2016]
definition: Flachbogen, Stichbogen, Segmentbogen; eine Bogenkonstruktion, deren Kreismittelpunkt unterhalb der Kämpferlinie liegt; der Pfeil beträgt im Allg. 1/6 - 1/12 Spannweite. [Koepf / Binding 2016]
in scheme: Begriffe für den Themenkomplex Sakralbau
in scheme: Quellennachweis Koepf / Binding 2016
in scheme: Quellennachweis Pax - Fenster & Türen Fachbegriffe
in scheme: Quellennachweis Glossarium Artis
in scheme: Bamberger Vokabular für Historische Architektur
preferred label: arco escarzano @es
preferred label: segmental arch @en
preferred label: arco (a sesto) ribassato @it
preferred label: oblouk segmentový @cs
preferred label: arc en segment @fr
broader by shape: Bogenform

Quellennachweis Glossarium Artis
type: NamedIndividual
type: ConceptScheme

Begriffe für den Themenkomplex Sakralbau
type: NamedIndividual
type: ConceptScheme

Bamberger Vokabular für Historische Architektur
type: NamedIndividual
type: ConceptScheme

Quellennachweis Koepf / Binding 2016
type: NamedIndividual
type: ConceptScheme

Quellennachweis Pax - Fenster & Türen Fachbegriffe
type: NamedIndividual
type: ConceptScheme