Innenraum
type: NamedIndividual
type: Concept
narrower: Loggia
preferred label: intravilán @cs

Loggia
type: NamedIndividual
type: Concept
created: 2019-10-22T09:14:31
modified: 2021-01-27T01:26:19
broader: Innenraum
definition: 1. Offene Bogenhalle, besonders in der ialienischen Renaissance; 2. Offener Raum im Obergeschoss, der innerhalb der Bauflucht liegt (im Unterschied zum vorspringenden Balkon). [Koch 2009]
definition: Užívá se také ve významu 1. Podloubí. 2. Galerie. 3. Otevřená arkádová hala, zvl. v ital. renesanci. 4. Otevřený prostor v horním podlaží, který končí v líci zdiva (na rozdíl od vysunutého balkonu). [Koch 2008] @cs
definition: Loggia (ital.), offene Laube bzw. Säulenhalle eines Bauwerks, vereinzelt auch als selbständige, offene Säulenhalle an ital. Plätzen. In der Regel tritt die Loggia nicht über die Bauflucht hervor. Repräsentative Loggen finden sich an Palästen seit der ital. Renaissance häufig, im 19./20. Jh. auch an Krankenhäusern und Hotels, aber auch im Wohnbau. [Glossarium Artis]
in scheme: Quellennachweis Koch 2009
in scheme: Quellennachweis Koch 2008
in scheme: Quellennachweis Glossarium Artis
in scheme: Bamberger Vokabular für Historische Architektur
in scheme: Strukturtypen für Wohn- und Nutzbauten
in scheme: Quellennachweis Koepf / Binding 2016
in scheme: Strukturtypen
preferred label: loggia @it
preferred label: lodžie @cs
preferred label: logia @es
related: Laube (Erschließung)
related: Galerie (Erschließung)
scope note: Gleichbedeutend mit Laube und Galerie. [Koch 2009]

Laube (Erschließung)
type: NamedIndividual
type: Concept
preferred label: gallery of arcades @en
preferred label: galerie d\'arcades @fr
preferred label: podloubí @cs
related: Loggia

Galerie (Erschließung)
type: NamedIndividual
type: Concept
preferred label: galerie @cs
related: Loggia

Quellennachweis Glossarium Artis
type: NamedIndividual
type: ConceptScheme

Quellennachweis Koch 2008
type: NamedIndividual
type: ConceptScheme

Bamberger Vokabular für Historische Architektur
type: NamedIndividual
type: ConceptScheme

Quellennachweis Koepf / Binding 2016
type: NamedIndividual
type: ConceptScheme

Quellennachweis Koch 2009
type: NamedIndividual
type: ConceptScheme

Strukturtypen für Wohn- und Nutzbauten
type: NamedIndividual
type: ConceptScheme

Strukturtypen
type: NamedIndividual
type: ConceptScheme