Wand
type: NamedIndividual
type: Concept
narrower: Obergadenwand
preferred label: stěna @cs
preferred label: partition @en
preferred label: paroi @fr
preferred label: parete @it
preferred label: pared @es

Obergadenwand
type: Concept
type: NamedIndividual
created: 2020-01-28T14:06:14
modified: 2021-01-22T19:43:48
alternative label: sobretecho con ventanas laterales @es
alternative label: Gaden
alternative label: cléristère @fr
alternative label: étage clair @fr
alternative label: Lichtgaden
alternative label: Obergaden
broader: Wand
definition: Der über die Seitenschiffdächer erhöhte, obere Teil (O.wand) des Mittelschiffs einer Basilika, in dem die Hochschifffenster (O.fenster) liegen. [Koepf/Binding 2016]
definition: Horní část stěny s okny nad střední lodí baziliky, níže položený pás oken bočních lodí se nazývá dolní okenní stěna. [Koch 2008] @cs
definition: Obergaden, Gaden, Lichtgaden; der über die Seitenschiffdächer erhöhte, obere Teil (Obergadenwand) des Mittelschiffs einer Basilika, in dem die Hochschifffenster (Obergadenfenster) liegen. [Koepf / Binding 2016]
definition: Lichtgaden, Obergaden, der obere, durch die Hochschifffenster belichtete Wandabschnitt der Basilika. Die niedriger gelegene Fensterzone der Seitenschiffe heißt Untergaden. [Koch 2009]
in scheme: Quellennachweis Koch 2008
in scheme: Bamberger Vokabular für Historische Architektur
in scheme: Strukturtypen
in scheme: Quellennachweis Koepf / Binding 2016
preferred label: claristorio @it
preferred label: horní okenní stěna @cs
preferred label: claraboya @es
preferred label: clerestory @en
preferred label: clairevoie @fr
broader by position: Wand

Quellennachweis Koch 2008
type: NamedIndividual
type: ConceptScheme

Bamberger Vokabular für Historische Architektur
type: NamedIndividual
type: ConceptScheme

Quellennachweis Koepf / Binding 2016
type: NamedIndividual
type: ConceptScheme

Strukturtypen
type: NamedIndividual
type: ConceptScheme