Gymnasion
type: NamedIndividual
type: Concept
created: 2020-08-05T12:42:59
modified: 2021-01-27T01:07:43
broader: Platz
definition: Řec. gymnos = nahý. Sportovní a školní objekt v antickém Řecku pro chlapce, jinochy a mladé muže, později rozšířen o stou, lázně, palestru (zápasnická škola), stadion (běžecká dráha) a učební sály. [Koch 2008] @cs
definition: Gymnasion (griech. gymnos = nackt), griechisch-antiker Sport- und Ausbildungsplatz für Knaben, Epheben, Jünglinge, später durch Stoa, Bad, Palaistra (Ringerschule), Stadion (Laufbahn) und Lehrsäle erweitert. [Koch 2009]
definition: (gr. gymnos: nackt), Schule mit Laufbahnen, Bädern und Hörsälen, die auch mit einer Ringerschule (Palästra) verbunden sein kann, für die körperl. Ausbildung der Knaben, Epheben und Jünglinge. Ein G. mit mehreren, terrassenförmig angelegten Stadien lag z.B. am Stadtrand von Priene. Eine große G.anlage mit mehreren Auditorien ist z.T. noch neben dem Demeterbezirk in Pergamon erhalten. [Koepf / Binding 2016]
in scheme: Strukturtypen
in scheme: Quellennachweis Koepf / Binding 2016
in scheme: Strukturtypen für Wohn- und Nutzbauten
in scheme: Quellennachweis Koch 2008
in scheme: Quellennachweis Koch 2009
in scheme: Bamberger Vokabular für Historische Architektur
preferred label: gymnasion @cs

Platz
type: NamedIndividual
type: Concept
narrower: Gymnasion
preferred label: place @fr
preferred label: piazza @it
preferred label: plaza @es

Quellennachweis Koch 2008
type: NamedIndividual
type: ConceptScheme

Bamberger Vokabular für Historische Architektur
type: NamedIndividual
type: ConceptScheme

Quellennachweis Koepf / Binding 2016
type: NamedIndividual
type: ConceptScheme

Quellennachweis Koch 2009
type: NamedIndividual
type: ConceptScheme

Strukturtypen für Wohn- und Nutzbauten
type: NamedIndividual
type: ConceptScheme

Strukturtypen
type: NamedIndividual
type: ConceptScheme