tragendes Holzgerüstelement
type: NamedIndividual
type: Concept
narrower: Sattelholz

Sattelholz
type: NamedIndividual
type: Concept
created: 2019-05-28T08:20:05
modified: 2020-11-26T16:10:43
alternative label: sedlo @cs
alternative label: sous-longeron @fr
alternative label: trave a sella @it
alternative label: bois @fr
alternative label: corbel piece @en
broader: tragendes Holzgerüstelement
definition: Ein waagerechtes Holz zur Verbreiterung des Auflagers über einem Ständer und zur Unterstützung eines Unterzugs. Durch Anordnung von einem oder mehreren S.ern kann die freie Spannweite von Unterzügen wie durch Kopfbüge (Büge) oder Streben verringert werden. Das S. hat auch die Aufgabe, das Hirnholz des Ständers vor dem Aufsplittern zu schützen. Formal sind auch verschiedene Kapitelle z.B. das ion. dem S. verwandt. [Koepf / Binding 2016]
definition: Sattelholz: kopfzoniges Holz über frei stehendem Ständer unter Unterzug bzw. Deckenbalken zur besseren Lastaufnahme, oft mit Kopf und/ oder von Ständerschalen umfasst; immer in Richtung des zu unterstützenden Balkens orientiert. (Eißing et al. 2012)
in scheme: Bamberger Vokabular für Historische Architektur
in scheme: Strukturtypen
in scheme: Quellennachweis Eißing et al. 2012
preferred label: bolster @en
preferred label: sobre viga de madera @es
preferred label: sottotrave @it
preferred label: semelle @fr
preferred label: trámové sedlo @cs

Quellennachweis Eißing et al. 2012
type: NamedIndividual
type: ConceptScheme

Bamberger Vokabular für Historische Architektur
type: NamedIndividual
type: ConceptScheme

Strukturtypen
type: NamedIndividual
type: ConceptScheme