Architekturoberflächengestaltungselement
type: NamedIndividual
type: Concept
narrower: Inkrustation (Architekturoberfläche)
preferred label: prvky utvářející architektonické povrchy @cs

Inkrustation (Architekturoberfläche)
type: NamedIndividual
type: Concept
created: 2019-07-15T13:42:02
modified: 2020-08-24T16:55:48
broader: Architekturoberflächengestaltungselement
definition: Bekleidung eines Mauerkörpers mit verschiedenfabigen Platten aus kostbareren Materialien wie Stein, Marmor und Ton, auch das Anbringen von Putz und Stuck. [Glossarium Artis, Bd. 3, Bögen und Mauerwerk]
definition: Inkrustation (lat. crusta = Rinde), Einlegearbeit von farbigen Steinen in Stein, bei der z.B. heller und dunkler Marmor wechseln (besonders in Wänden und Fußböden). Blütezeit: Antike, Byzantinische Kunst, Italien vom Mittelalter bis Barock. [Koch 2009]
in scheme: Strukturtypen
in scheme: Bamberger Vokabular für Historische Architektur
in scheme: Quellennachweis Glossarium Artis
in scheme: Quellennachweis Koepf / Binding 2016
in scheme: Quellennachweis Koch 2009
preferred label: inkrustation @en
preferred label: inkrustace @cs
preferred label: incrustation @fr
scope note: Inkrustation (lat.), Bekleidung von Wänden und Fassaden aus verschiedenfarbigen Blendsteinen, die oft in Anlehnung an konstruktive Vorbilder rein ornamental angebracht sind. Bekannt sind die Cosmatenarbeiten sowie die I.en an Bauten der Protorenaissance in Italien. [Koepf / Binding 2016]

Quellennachweis Glossarium Artis
type: NamedIndividual
type: ConceptScheme

Bamberger Vokabular für Historische Architektur
type: NamedIndividual
type: ConceptScheme

Quellennachweis Koepf / Binding 2016
type: NamedIndividual
type: ConceptScheme

Quellennachweis Koch 2009
type: NamedIndividual
type: ConceptScheme

Strukturtypen
type: NamedIndividual
type: ConceptScheme