zeitliche Eigenschaft
type: NamedIndividual
type: Concept
narrower: vorreformatorisch

vorreformatorisch
type: NamedIndividual
type: Concept
created: 2019-12-17T14:58:27
modified: 2019-12-17T15:01:37
broader: zeitliche Eigenschaft
in scheme: Bamberger Vokabular für Historische Architektur
scope note: Der Begriff definiert die Zeit vor Einführung der Reformation. Bezugnehmend auf die Stadt Nürnberg ist das Jahr 1525 gemeint.

Bamberger Vokabular für Historische Architektur
type: NamedIndividual
type: ConceptScheme