Keilstein
type: NamedIndividual
type: Concept
narrower: Agraffe (Keilstein)
preferred label: voussoir @en
preferred label: klenák @cs
preferred label: claveau @fr

Agraffe (Keilstein)
type: NamedIndividual
type: Concept
created: 2019-10-22T14:58:33
modified: 2021-01-22T15:45:22
broader: Keilstein
definition: Hoher Keilstein, der zwei Steinschichten miteinander verbindet, als Schlussstein eines Bogens oft mit einer Maske o. Ä. verziert, auch volutenförmig oder als Medaillon vom Rundbogenscheitel zum Gebälk überleitend. [Koepf / Binding 2016]
definition: Aus dem Französischen stammende Bezeichnung für einen besonders gestalteten Schlussstein am Scheitel eines Rundbogens. [Schrader / Voigt 2003]
definition: Schlusssteinartig ausgebildete Volute zwischen Rundbogenscheitel und Gebälk. [Koch 2009]
definition: AGRAFA, svorníkovitě tvarovaná voluta mezi závěrem půlkruhového oblouku a kladím. [Koch 2008] @cs
in scheme: Quellennachweis Koepf / Binding 2016
in scheme: Quellennachweis Koch 2009
in scheme: Quellennachweis Koch 2008
in scheme: Quellennachweis Schrader / Voigt 2003
in scheme: Bamberger Vokabular für Historische Architektur
in scheme: Strukturtypen
preferred label: agraffe @en
preferred label: agrafe @fr
preferred label: ágrafe @es
preferred label: agrafa @cs
related: Volute

Volute
type: NamedIndividual
type: Concept
preferred label: volute @fr
preferred label: voluta @it
related: Agraffe (Keilstein)

Quellennachweis Koch 2008
type: NamedIndividual
type: ConceptScheme

Quellennachweis Schrader / Voigt 2003
type: NamedIndividual
type: ConceptScheme

Bamberger Vokabular für Historische Architektur
type: NamedIndividual
type: ConceptScheme

Quellennachweis Koepf / Binding 2016
type: NamedIndividual
type: ConceptScheme

Quellennachweis Koch 2009
type: NamedIndividual
type: ConceptScheme

Strukturtypen
type: NamedIndividual
type: ConceptScheme