Stahl
type: NamedIndividual
type: Concept
related: Stahlbeton

Verbundwerkstoff
type: NamedIndividual
type: Concept
narrower: Stahlbeton

Beton
type: NamedIndividual
type: Concept
preferred label: hormigón @es
preferred label: concrete @en
preferred label: calcestruzzo @it
preferred label: béton @fr
preferred label: beton @cs
related: Stahlbeton

Stahlbeton
type: NamedIndividual
type: Concept
created: 2020-08-12T17:02:11
modified: 2020-11-27T18:43:23
alternative label: železobeton @cs
alternative label: calcestruzzo armato @it
alternative label: vyztužený beton @cs
broader: Verbundwerkstoff
in scheme: Quellennachweis Koepf / Binding 2016
in scheme: Bamberger Vokabular für Historische Architektur
preferred label: železový beton @cs
preferred label: reinforced concrete @en
preferred label: béton armé @fr
preferred label: hormigón armado @es
preferred label: cemento (calcestruzzo) armato @it
related: Stahl
related: Beton
scope note: Eisenbeton ist die veraltete Bezeichnung für Stahlbeton.
scope note: Ein Verbundkörper aus Beton und einer Stahlbewehrung, der so ausgeführt ist, dass der Beton nur die Druckspannungen, der Stahl meist nur die Zugspannungen aufzunehmen hat. Der S. wird auf vorfabrizierten oder eigens für einen bestimmten Bauteil angefertigten Schalungen gegossen, die nach Erhärten des Materials wieder entfernt werden können. Je nach Art der Ausbildung einer S.konstruktion unterscheidet man Pilz-, Rippen-, Platten- und Plattenbalkendecken, Rahmen, Schalen u. dergl. [Koepf / Binding 2016]

Bamberger Vokabular für Historische Architektur
type: NamedIndividual
type: ConceptScheme

Quellennachweis Koepf / Binding 2016
type: NamedIndividual
type: ConceptScheme