Oxalatpatina
type: NamedIndividual
type: Concept
broader: Patina
preferred label: patine d’oxalates @fr
preferred label: oxalátová patina @cs
preferred label: oxalate patina @en

Eisenreiche Patina
type: NamedIndividual
type: Concept
broader: Patina
preferred label: železem bohatá patina @cs
preferred label: patine ferrugineuse @fr
preferred label: iron rich patina @en

Schaden der Architekturoberfläche
type: NamedIndividual
type: Concept
narrower: Patina

Patina
type: NamedIndividual
type: Concept
created: 2019-07-14T13:52:54
modified: 2021-01-30T17:50:06
broader: Schaden der Architekturoberfläche
definition: Modification chromatique superficielle, résultant d’une altération naturelle ou artificielle et n`impliquant généralement pas de dégradation superficielle visible. [ICOMOS-ISCS] @fr
definition: Auch Edelrost, die äußere Schicht auf Kupfer und Bronze, die mit der Zeit durch Oxidation entsteht, aber auch oft künstlich erzeugt oder imitiert wird. Ihre grüne, braune oder schwarze Farbe gilt als Zeichen ehrwürdigen Alters. [Koch 2009]
definition: Chromatic modification of the material, generally resulting from natural or artificial ageing and not involving in most cases visible surface deterioration. [ICOMOS-ISCS] @en
definition: Barevná přeměna materiálu, obecně vzniklá přírodnímnebo umělým stárnutím materiálu a neobsahujícíve většině případů viditelné povrchové poškození. [ICOMOS-ISCS] @cs
definition: Farbliche Veränderung des Materials, allgemein re - sultierend aus natürlicher oder künstlicher Alterung. Mit Patina ist in der Regel keine sichtbare Schä - digung der Oberfläche verbunden. [ICOMOS-ISCS]
definition: Povrchová vrstva na mědi a bronzu vznikající oxidací, často však bývá i uměle vytvářena nebo imitována. Její zelená, hnědá nebo černá barva bývá považována za známku úctyhodného stáří. [Koch 2008] @cs
in scheme: Quellennachweis EwaGlos
in scheme: Quellennachweis Koch 2009
in scheme: Begriffe für Naturstein- und Wandmalereirestaurierung
in scheme: Begriffe für Bauerhalt
in scheme: Quellennachweis Koch 2008
in scheme: Quellennachweis ICOMOS-ISCS
in scheme: Bamberger Vokabular für Historische Architektur
narrower: Eisenreiche Patina
narrower: Oxalatpatina
note: A natural alteration which appears at the surface of various materials due to ageing, use, handling, oxidation, and/or exposure to the environment. A patina can also be applied artificially. [EwaGlos] @en
note: Eine natürliche Veränderung, die sich auf der Oberfläche verschiedener Materialien durch Alterung, Benutzung, Gebrauch, Oxidation und/oder Umwelteinflüsse ergeben kann. Sie kann auch künstlich aufgebracht werden. [EwaGlos]
preferred label: patine @fr
preferred label: patina @en

Begriffe für Bauerhalt
type: NamedIndividual
type: ConceptScheme

Quellennachweis ICOMOS-ISCS
type: NamedIndividual
type: ConceptScheme

Quellennachweis Koch 2008
type: NamedIndividual
type: ConceptScheme

Bamberger Vokabular für Historische Architektur
type: NamedIndividual
type: ConceptScheme

Quellennachweis Koch 2009
type: NamedIndividual
type: ConceptScheme

Quellennachweis EwaGlos
type: NamedIndividual
type: ConceptScheme

Begriffe für Naturstein- und Wandmalereirestaurierung
type: NamedIndividual
type: ConceptScheme