Quellennachweis Koch 2009
type: NamedIndividual
type: ConceptScheme

Quellennachweis Koepf / Binding 2016
type: NamedIndividual
type: ConceptScheme

Strukturtypen für Burgen und Schlösser
type: NamedIndividual
type: ConceptScheme

Bergfried
type: Concept
definition: Hauptturm einer Burganlage, der jedoch in Abgrenzung zum Wohnturm nicht für eine dauerhafte Bewohnung eingerichtet war. Der Begriff »B.« wurde in der deutschsprachigen Burgenforschung im Laufe der 2. Hälfte des 19. Jh.s in Anlehnung an einen mittelalterlichen Begriff (ahd. bergfrit, mhd. bervride ›Angriffs- und Verteidigungsturm‹) eingeführt. Während der Wohnturm Wohn- und Wehrzwecke vereinte, handelte es sich beim B. um eine eigenständige Wehreinrichtung, der Wohnbereich lag separat in einem anderen Gebäude ( Palas). Im Unterschied zum älteren Wohnturm treten B.e erstmals um oder bald nach der Mitte des 12. Jh.s auf (Drachenfels NW vor 1149, Manderscheid RP 1166). Bei einigen salierzeitlichen Türmen, die nur in den Grundmauern erhalten sind, könnten die Maße ebenfalls für eine Rekonstruktion als B. sprechen, ohne dies jedoch sicher genug belegen zu können. Vom späten 12. Jh. bis in die 1. Hälfte des 14. Jh.s prägt der B. die Burgenlandschaft Mitteleuropas, wohingegen er in Frankreich (Donjon) und England selten auftritt. Die Lage des B.s innerhalb der Burganlage variiert. Es gab frei im Zentrum der Burg stehende B.e (Marksburg RP). Häufig war der B. aber auch dezentral positioniert, bei Spornanlagen (Sporn) häufig zur Angriffsseite hin verschoben, so dass seine Mauermasse als Schutz für die hinter ihm liegenden Gebäude diente (Gutenfels RP). Häufig deckte er zudem den Burgweg und das Tor. Oft war der B. auch mit der Ring- oder Schildmauer kombiniert. Er konnte dabei frei dahinter stehen (Ortenberg/Elsass F) oder sogar in diese eingebunden sein (Freienfels HE). Meist war der Grundriss der B.e gedrungen rechteckig oder quadratisch; die Seitenlänge viereckiger B.e reichte üblicherweise von 6 m bis 12 m, jedoch gab es auch kleinere oder breitere Beispiele. Eine klassische Seitenlänge lag bei etwa 10 m. Am zweithäufigsten waren runde B.e mit einem Durchmesser von in der Regel 7–13 m, wobei auch hierbei Abweichungen möglich waren. Aber auch andere Grundrissformen (drei-,…
definition: Hlavní věž hradu zvaná též belfried apod., v Nizozemsku a Belgii zvl. městská reprezentační věž. [Koch 2008] @cs
definition: Hauptturm einer Burg. Auch Belfried, in den Niederlanden und Belgien besonders für städtischen Repräsentationsturm. [Koch 2009]
definition: Bergfried, Berchfrit (ma. bercvrit; 1836 von H. Leo eingeführt): hoher, mächtiger, rechteckiger, runder oder polygonaler Turm der ma. Burg; dient der Repräsentation, als Ausguck und letzte Zuflucht für die Burgbewohner; er diente nicht, wie der Donjon, zum dauernden Wohnen, auch wenn er in den oberen Geschossen häufig mit Kamin und Abtritt ausgestattet war; bei eingezogenem, oberem Aufbau Butterfass, bei Rundturm auch Sinwellturm genannt. Hochgelegener Einstieg, über abwerfbare Holzleiter oder Holzsteg zugängl., im Untergeschoss das durch das Angstloch zugängl. Verließ, von der oberen, von Zinnen gesicherten Plattform zu verteidigen; im späten MA mit auskragenden Ecktürmen bereichert. [Koepf / Binding 2016]
modified: 2021-01-27T13:30:04
preferred label: bergfried @cs
in scheme: Quellennachweis Koepf / Binding 2016
in scheme: Quellennachweis Koch 2008
in scheme: Strukturtypen für Burgen und Schlösser
in scheme: Quellennachweis Wörterbuch der Burgen, Schlösser und Festungen
in scheme: Strukturtypen
in scheme: Bamberger Vokabular für Historische Architektur
in scheme: Quellennachweis Koch 2009
scope note: Der Bergfried (auch "Berchfrit") ist der unbewohnte Hauptturm einer mitteleuropäischen Burg und entwickelte sich aus dem Wohnturm (in Westeuropa auch Donjon genannt). Der Bautyp entstand im Laufe des 12. Jahrhunderts und wird seit dem späten 12. Jahrhundert bis in das 14. Jahrhundert hinein auf zahlreichen Burgen errichtet.
type: NamedIndividual
broader: Turm
created: 2020-01-21T17:24:41

Quellennachweis Koch 2008
type: NamedIndividual
type: ConceptScheme

Quellennachweis Wörterbuch der Burgen, Schlösser und Festungen
type: NamedIndividual
type: ConceptScheme

Strukturtypen
type: NamedIndividual
type: ConceptScheme

Bamberger Vokabular für Historische Architektur
type: NamedIndividual
type: ConceptScheme

Turm
type: NamedIndividual
preferred label: věž @cs
preferred label: tower @en
preferred label: tour @fr
preferred label: torre @it
type: Concept
narrower: Bergfried