Quellennachweis Noky 1996
type: NamedIndividual
type: ConceptScheme

Doppelreiber
type: NamedIndividual
in scheme: Quellennachweis Pax - Fenster & Türen Fachbegriffe
in scheme: Bamberger Vokabular für Historische Architektur
in scheme: Quellennachweis Noky 1996
in scheme: Strukturtypen
alternative label: Doppelvorreiber
created: 2019-06-12T18:27:52
definition: Reiber mit zweiseitigem Riegel, der zwei Flügel verschließt und i. d. R. am Pfosten angebracht ist. [Noky 1996]
definition: Fensterbeschlag zum Verriegeln eines Fensters aus einem doppelten Reiber aus Rundeisen oder später Gußmaterial. Besitzt eingerollte Enden und eine breit geschmiedete Mitte, durch die der Doppelvorreiber mit einem Nagel am Mittelpfosten befestigt wird. [Pax - Fenster & Türen Fachbegriffe]
type: Concept
modified: 2021-01-22T14:42:24
broader: Reiber

Quellennachweis Pax - Fenster & Türen Fachbegriffe
type: NamedIndividual
type: ConceptScheme

Bamberger Vokabular für Historische Architektur
type: NamedIndividual
type: ConceptScheme

Strukturtypen
type: NamedIndividual
type: ConceptScheme

Reiber
type: NamedIndividual
preferred label: perilla de ventana @es
preferred label: maniglia di finestra @it
preferred label: frottoir @fr
type: Concept
narrower: Doppelreiber