Quellennachweis Koch 2009
type: NamedIndividual
type: ConceptScheme

Strukturtypen für Burgen und Schlösser
type: NamedIndividual
type: ConceptScheme

Strukturtypen
type: NamedIndividual
type: ConceptScheme

Burg
type: NamedIndividual
preferred label: hrad @cs
type: Concept
narrower: Ganerbenburg

Ganerbenburg
type: NamedIndividual
definition: Von mehreren Familien in verschiedenen Häusern bewohnte Burg. [Koch 2009]
definition: Hrad, jehož různé budovy obývá několik rodově spřízněných rodin. [Koch 2008] @cs
definition: Burgen, die sich in gemeinschaftlichem Besitz einer Ganerbschaft, also verschiedener Herrschaften bzw. Familien befinden, die gemeinsame Nutzungsrechte innehaben. G.en gab es seit dem Hochmittelalter (Saffenburg RP, 12. Jh.; Are RP, 12. Jh.), doch waren sie insbesondere ein spätmittelalterliches und frühneuzeitliches Phänomen. Oft führte Erbfolge, bisweilen auch (Teil-)Verpfändungen zur Besitzteilung innerhalb einer Burg. Auch werden Burgen im gemeinsamen Besitz adeliger Interessengruppen als G.en bezeichnet. Die verschiedenen Anteile der einzelnen Ganerben bzw. Gemeiner an der Burg sind im Baubestand bei einzelnen Anlagen noch architektonisch nachweisbar (Eltz RP, Montfort RP, Salzburg BY) oder nur noch aus der schriftlichen Überlieferung (Burgfriedenverträge) zu erschließen (Hatzfeld HE, Waldeck HE, Reifenberg HE). Tore, Wege, Brunnen, Kapelle und Bergfried befanden sich vielfach in gemeinschaftlichem Besitz der Ganerben bzw. Gemeiner. Die bauliche Unterhaltung der gemeinschaftlichen Bauten wurde häufig in Burgfriedensverträgen geregelt. Teilweise waren die Besitzanteile der Ganerben baulich deutlich gegeneinander abgegrenzt und verfügten über separate Befestigungen (»Burg in der Burg«), mit eigenem Wohnturm (Schauenburg BW, Montfort RP) oder bildeten eine eigenständige Bautengruppe, bestehend aus Wohnbau, Bergfried und Ringmauer (Schönburg RP, Salzburg BY). Bisweilen konnten G.en alleine oder als bauliche Einheit mit der Burgsiedlung stadtartigen Charakter haben (Burgsiedlung Lindheim / Wetterau HE: hier waren im 15. Jh. bis zu 56 Ganerben begütert). Oft führten Ganerbenschaften wegen andauernder Besitzstreitigkeiten zur Stagnation in der Entwicklung der den Burgen zugehörigen Siedlungen.J. F. /M. L. [Wörterbuch der Burgen, Schlösser und Festungen]
modified: 2021-01-27T10:51:37
in scheme: Quellennachweis Koch 2008
in scheme: Quellennachweis Wörterbuch der Burgen, Schlösser und Festungen
in scheme: Quellennachweis Koch 2009
in scheme: Strukturtypen
in scheme: Strukturtypen für Burgen und Schlösser
in scheme: Bamberger Vokabular für Historische Architektur
type: Concept
broader: Burg
preferred label: rodový hrad @cs
created: 2020-07-03T15:48:13

Quellennachweis Koch 2008
type: NamedIndividual
type: ConceptScheme

Quellennachweis Wörterbuch der Burgen, Schlösser und Festungen
type: NamedIndividual
type: ConceptScheme

Bamberger Vokabular für Historische Architektur
type: NamedIndividual
type: ConceptScheme