Fischgrätverband
type: Concept
preferred label: klasová vazba @cs
preferred label: opus spicatum @la
in scheme: Begriffe für Bauerhalt
in scheme: Quellennachweis Koepf / Binding 2016
in scheme: Quellennachweis Schrader / Voigt 2003
in scheme: Bamberger Vokabular für Historische Architektur
modified: 2021-03-19T19:09:27
alternative label: Ährenwerk
alternative label: Fischgrätenverband
alternative label: Ährenverband
narrower: Schrägschar
narrower: Acoltello
type: NamedIndividual
broader: Mauerverband
definition: Ährenwerk (lat. opus spicatum), 1. eine Art des Mauerverbands, bei dem die Steine in zwei übereinanderliegenden Schichten abwechselnd schräg zueinander gesetzt sind (Schrägschar, Stromschicht), so dass ein ährenähnl. (Fischgrat-)Muster entsteht, auch als Ausgleichsschicht bei flachliegendem Steinmaterial oder im Backsteinbau. 2. Die gleiche Anordnung flach verlegter Steine beim Backstein Pflaster (Acoltello). [Koepf / Binding 2016]
definition: Fischgrat, Fischgrätenverband, eine Art des Mauerverbandes, Ährenwerk. [Koepf / Binding 2016]
definition: Fischgrätmauerwerk, bei dem die Steine ein Ähren- oder Fischgrätmuster bilden. B. Sch.-W. [Wörterbuch der Burgen, Schlösser und Festungen]
definition: Römischer Mauerziegelverband, bei dem dünne Mauerziegel hochkant in zwei Lagen schräggegeneinander versetzt in einem Fischgrätmuster angeordnet werden. Diese Verlegetechnik gibt es auch bei Böden. [Schrader / Voigt 2003]
definition: Dt. Bezeichnung (auch »Ährenmauerwerk«) für einen Verband aus Ziegeln, der schon von den Römern verwendet und von ihnen opus spicatum genannt wurde. Dabei werden in einzelnen Lagen die Ziegel oder flach behauenen Natursteine schräg, und zwar abwechselnd nach links oder rechts geneigt, vermauert, so dass sich eine Fischgrätenstruktur ergibt. B. Sch.-W. [Wörterbuch der Burgen, Schlösser und Festungen]
created: 2019-05-07T11:55:24

Begriffe für Bauerhalt
type: NamedIndividual
type: ConceptScheme

Quellennachweis Koepf / Binding 2016
type: NamedIndividual
type: ConceptScheme

Quellennachweis Schrader / Voigt 2003
type: NamedIndividual
type: ConceptScheme

Bamberger Vokabular für Historische Architektur
type: NamedIndividual
type: ConceptScheme

Schrägschar
type: NamedIndividual
preferred label: řada cihel při klenutí "na vlaštovčí ocas" @cs
type: Concept
broader: Fischgrätverband

Acoltello
type: NamedIndividual
type: Concept
broader: Fischgrätverband

Mauerverband
type: NamedIndividual
type: Concept
narrower: Fischgrätverband