Darstellungsinhalt
type: NamedIndividual
type: Concept
narrower: Amorette

Amorette
type: NamedIndividual
type: Concept
created: 2020-08-03T11:28:49
preferred label: amorek @cs
in scheme: Quellennachweis Koch 2008
in scheme: Bamberger Vokabular für Historische Architektur
in scheme: Quellennachweis Koch 2009
definition: Meist geflügelter kleiner Knabe als Liebesgott in weltlichen Szenen besonders des Rokoko nach dem Vorbild der antiken Eroten. [Koch 2009]
definition: Většinou okřídlený chlapeček jako bůžek lásky ve světských scénách, zvl. ,; době rokoka podle vzoru antických erotů. [Koch 2008] @cs
modified: 2021-01-27T09:56:08
broader: Darstellungsinhalt

Quellennachweis Koch 2008
type: NamedIndividual
type: ConceptScheme

Bamberger Vokabular für Historische Architektur
type: NamedIndividual
type: ConceptScheme

Quellennachweis Koch 2009
type: NamedIndividual
type: ConceptScheme