Begriffe für Naturstein- und Wandmalereirestaurierung
type: NamedIndividual
type: ConceptScheme

Quellennachweis ICOMOS-ISCS
type: NamedIndividual
type: ConceptScheme

Begriffe für Bauerhalt
type: NamedIndividual
type: ConceptScheme

Inkrustation (Schaden)
type: NamedIndividual
preferred label: incrustace @cs
preferred label: encrustation @en
preferred label: encroûtement @fr
type: Concept
narrower: Konkretion

Konkretion
type: Concept
in scheme: Begriffe für Bauerhalt
in scheme: Quellennachweis ICOMOS-ISCS
in scheme: Bamberger Vokabular für Historische Architektur
in scheme: Begriffe für Naturstein- und Wandmalereirestaurierung
broader: Inkrustation (Schaden)
definition: Sorte d’encroûtement en forme de dépôt compact noduleux, botryoïde (comme une grappe) ou framboïde (comme une framboise). Une concrétion peut même avoir des formes coniques ou constituer des feuillets verticaux (draperies). Les stalagmites et stalactites sont des sortes de concrétions. En général, les concrétions ont une épaisseur irrégulière et ne suivent pas les contours des pierres. Elles ont une extension latérale limitée. [ICOMOS-ISCS] @fr
definition: Kind of encrustation having a specific shape: nodular, botryoïdal (grape-like) or framboïdal (raspberry like). Concretions may even have conic shapes of form drapery-like vertical sheets. Stalagmites and stalactites are kinds of concretions. In general, concretions do not outline, contour the surface of the stone, and are of limited extent. [ICOMOS-ISCS] @en
definition: druh inkrustace, mající specifický tvar: hlíznatý, ledvinitý (tvar hroznu) nebo framboidální (tvar maliny). Konkrece mohou mít dokonce konické tvary ve formě záclonovitých svislých listů. Stalagmity a stalaktity jsou druhem konkrecí. Obecně konkrece nezvýrazňují a nekonturují hranice povrchu kamene a jsou omezené ve svém rozsahu. [ICOMOS-ISCS] @cs
definition: Stellt eine Art von Inkrustation mit besonderer Form dar: knotenförmig/kugelig, traubenförmig, himbeerförmig. Konkretionen können auch konische Formen wie faltenreiche Vorhänge haben. Stalagmiten und Stalaktiten werden ebenfalls zu den Konkretionen gezählt. Im Allgemeinen fließt die Form von Konkretionen nicht aus, sie zeichnet die Gesteinsoberfläche nach und ist von begrenzter Größe. [ICOMOS-ISCS]
created: 2019-11-07T13:32:47
preferred label: concrétion @fr
preferred label: concretion @en
preferred label: konkrece @cs
type: NamedIndividual
modified: 2021-01-30T16:45:49

Bamberger Vokabular für Historische Architektur
type: NamedIndividual
type: ConceptScheme