Quellennachweis Koepf / Binding 2016
type: NamedIndividual
type: ConceptScheme

Strukturtypen
type: NamedIndividual
type: ConceptScheme

Fachwerkbinder
type: NamedIndividual
type: Concept
broader: Dachbinder

Dachelement
type: NamedIndividual
preferred label: části střechy @cs
type: Concept
narrower: Dachbinder

Dachbinder
type: NamedIndividual
broader: Dachelement
in scheme: Quellennachweis Koepf / Binding 2016
in scheme: Bamberger Vokabular für Historische Architektur
in scheme: Strukturtypen
modified: 2020-09-10T12:58:36
narrower: Fachwerkbinder
definition: Das die Sparren aufnehmende Tragwerk einer Dachkonstruktion, das in größeren Abständen zwischen den Leergesprängen eingefügt ist; die darauf liegenden Sparren heißen Hauptsparren, Bindersparren oder Gebindesparren; die Gesamtheit der Konstruktion heißt Gebinde bzw. Bundgespärre oder Vollgespärre. [Koepf / Binding 2016]
definition: Beim Dachwerk das die Sparren oder Pfetten aufnehmende Tragwerk, das in großen Abständen zwischen den Leergespärren vorkommt (Dachkonstruktion). [Koepf / Binding 2016]
preferred label: střešní vazník @cs
created: 2020-08-28T16:22:21
type: Concept

Bamberger Vokabular für Historische Architektur
type: NamedIndividual
type: ConceptScheme