Quellennachweis Koch 2009
type: NamedIndividual
type: ConceptScheme

Quellennachweis Koepf / Binding 2016
type: NamedIndividual
type: ConceptScheme

Strukturtypen
type: NamedIndividual
type: ConceptScheme

Quellennachweis Koch 2008
type: NamedIndividual
type: ConceptScheme

Aquädukt
type: Concept
preferred label: akvadukt @cs
in scheme: Quellennachweis Koch 2009
in scheme: Quellennachweis Koch 2008
in scheme: Strukturtypen
in scheme: Quellennachweis Koepf / Binding 2016
in scheme: Bamberger Vokabular für Historische Architektur
broader: Wasserversorgungselement
definition: Antická římská stavba, většinou obloukový most s otevřeným nebo krytým žlabem, jímž byla do sídla samospádem přiváděna voda, zvl. v římské Campagne, jižní Francii (Nimes), Španělsku (Segovia). [Koch 2008] @cs
definition: Aquädukt (lat. aquae ductus = Wasserleitung), römisch-antike Anlage, im besonderen eine Bogenbrücke mit der eine Wasserrinne offen oder verdeckt im natürlichen Gefälle des Wassers in eine Siedlung geleitet wurde. Besonders in der römischen Campagna, Süd-Frankreich (Nimes), Spanien (Segovia). [Koch 2009]
definition: Aquädukt (lat. aquae ductus: Wasserleitung), in der röm. Kaiserzeit entwickelte Gefällewasserleitung. Durch eine von hohen, oft mehrstöckigen Bogenstellungen getragene Rinne mit leichtem Gefälle konnte das Gebirgswasser über Täler und Ebenen hinweg in die Städte fließen. [Koepf / Binding 2016]
modified: 2020-09-02T10:47:39
type: NamedIndividual
created: 2020-08-03T12:16:04

Bamberger Vokabular für Historische Architektur
type: NamedIndividual
type: ConceptScheme

Wasserversorgungselement
type: NamedIndividual
type: Concept
narrower: Aquädukt