Darstellungsinhalt
type: NamedIndividual
type: Concept
narrower: Scheinarchitektur

Scheinarchitektur
type: NamedIndividual
preferred label: illusionistic architecture @en
preferred label: architettura finta @it
preferred label: architecture simulée @fr
preferred label: arquitectura aparente @es
preferred label: iluzivní architektura @cs
broader: Darstellungsinhalt
definition: Durch Malerei oder Relief vorgetäuschte Architekturteile an Wänden oder Decken, die den Innenraum meist illusionistisch erweitern. Besonders pompejanische Architektur und Barock. [Koch 2009]
definition: Eine illusionist. gemalte oder durch Reliefwirkung nur angedeutete Architektur, die räuml. nicht existiert. S. findet man v. a. in barocken Kirchenbauten, um eine Raumausweitung zu erzielen. [Koepf / Binding 2016]
definition: Architektonické prvky napodobené pomocí malby nebo reliéfu na stěnách nebo klenbách, které iluzivně rozšiřují vnitřní prostor, zvl. pompejská architektura a baroko. [Koch 2008] @cs
type: Concept
alternative label: arquitectura simulada @es
alternative label: architettura trompe-l\'œil @it
in scheme: Bamberger Vokabular für Historische Architektur
in scheme: Quellennachweis Koch 2009
in scheme: Quellennachweis Koch 2008
created: 2020-08-11T17:20:07
modified: 2021-01-26T17:06:59

Bamberger Vokabular für Historische Architektur
type: NamedIndividual
type: ConceptScheme

Quellennachweis Koch 2009
type: NamedIndividual
type: ConceptScheme

Quellennachweis Koch 2008
type: NamedIndividual
type: ConceptScheme