Quellennachweis Koch 2009
type: NamedIndividual
type: ConceptScheme

Paneel
type: NamedIndividual
preferred label: pannello @it
preferred label: panneau @fr
preferred label: panel @en
type: Concept
broader: Vertäfelung

Strukturtypen
type: NamedIndividual
type: ConceptScheme

Wandgestaltung
type: NamedIndividual
preferred label: úprava stěn @cs
type: Concept
narrower: Vertäfelung

Quellennachweis Koch 2008
type: NamedIndividual
type: ConceptScheme

Vertäfelung
type: NamedIndividual
alternative label: entarimado @es
alternative label: wainscoting @en
alternative label: obložení @cs
alternative label: táflování @cs
alternative label: Täfelwerk
alternative label: boiserie @it
alternative label: Täfelung
alternative label: Iambrissage (en bois) @fr
alternative label: artesonado @es
alternative label: Getäfel
in scheme: Bamberger Vokabular für Historische Architektur
in scheme: Quellennachweis Koch 2008
in scheme: Quellennachweis Koch 2009
in scheme: Strukturtypen
preferred label: rivestimento ligneo @it
preferred label: tabletterie @fr
preferred label: deštění @cs
preferred label: revestimiento de madera @es
preferred label: paneling @en
definition: Auch Täfelung, Getäfel, Holzverkleidung von Decken und Wänden, bes. im Nord-Europa des 15. bis 1 8. Jhs., oft mit reichem Schnitzwerk. [Koch 2009]
definition: Täfelung, Wand- oder Deckenbekleidung mit Holztafeln. [Koepf / Binding 2016]
definition: Vor allem nördlich der Alpen die verbreitetste Art der Wandverkleidung aus Holz, die zugleich als WärmeIsolierung und Raumschmuck dient. Eine aus Rahmen und Füllungen bestehende Holzkonstruktion wird dabei direkt vor die Stein- oder Fachwerkwand gesetzt und oben mit einem Gesims oder Fries abgeschlossen. Im einfachsten Fall bestehen die Rahmen aus schlichten Profilen und die Füllungen sind glatt und unverziert. Die Rahmen können aber auch reich differenziert, die abschließenden Friese mit Maßwerk oder Schnitzereien verziert und die Füllungen bemalt oder mit Intarsien versehen sein. Dann sind Türen und Fensterläden in die Gestaltung einbezogen (Hohensalzburg/Salzburg A). Diese Art der Wandgestaltung wird neben Tapisserien und Stoffbespannungen bis ins 18. Jh. beibehalten, wobei sich das Dekor dem jeweiligen Zeitstil anpasst. Im 17. und 18. Jh. wird die jetzt deutlich niedrigere und flacher gearbeitete V. nach dem französischen Vorbild Boiserie genannt. B. Sch.-W. [Wörterbuch der Burgen, Schlösser und Festungen].
definition: Dřevěné obložení stropů a stěn, zvl. v severní Evropě v 15. až 18. stol., často s bohatou řezbářskou výzdobou. [Koch 2008] @cs
broader: Wandgestaltung
narrower: Paneel
narrower: Boiserie
type: Concept
modified: 2020-11-30T18:48:42
created: 2020-04-28T16:49:49

Bamberger Vokabular für Historische Architektur
type: NamedIndividual
type: ConceptScheme

Boiserie
type: NamedIndividual
preferred label: boiserie @cs
type: Concept
broader: Vertäfelung