Quellennachweis Koch 2009
type: NamedIndividual
type: ConceptScheme

Quellennachweis Koepf / Binding 2016
type: NamedIndividual
type: ConceptScheme

Lohstein
type: Concept
type: NamedIndividual
broader: gebrannter Ziegel
preferred label: perforated brick @en
preferred label: brique tanisée @fr
preferred label: ladrillo artificialmente poroso @es
preferred label: tříslová cihla @cs
preferred label: pietra artificialmente porosa @it
in scheme: Bamberger Vokabular für Historische Architektur
in scheme: Quellennachweis Koch 2008
in scheme: Quellennachweis Koepf / Binding 2016
in scheme: Strukturtypen
in scheme: Quellennachweis Koch 2009
definition: Velmi lehká cihla, vzniklá přimísením koželužského třísla, které při vypalování zanechává dutiny, používaná v gotice ke stavbu klenby. [Koch 2008] @cs
definition: Durch Beimengung von Gerberlohe, die beim Brennen Hohlräume hinterlässt, bes. leichter Backstein, in der Gotik für Gewölbe verwendet. [Koch 2009]
definition: Lohstein, got. Gewölbestein aus gebranntem Ton (Backstein), bes. leicht durch Beimengung von Gerberlohe, die durch den Brennvorgang zerstört wird und dadurch Hohlräume entstehen lässt. [Koepf / Binding 2016]
created: 2019-08-19T13:35:12
modified: 2021-03-19T18:30:44

gebrannter Ziegel
type: NamedIndividual
type: Concept
narrower: Lohstein

Bamberger Vokabular für Historische Architektur
type: NamedIndividual
type: ConceptScheme

Quellennachweis Koch 2008
type: NamedIndividual
type: ConceptScheme

Strukturtypen
type: NamedIndividual
type: ConceptScheme