Bildsäule
type: NamedIndividual
type: Concept
narrower: Rolandsäule

Rolandsäule
type: NamedIndividual
definition: Rolandsäule, vom 14. bis 18. Jh. etwa zwischen Weser und Prag, südlich bis Dubrovnik verbreitete Bildsäule aus Holz oder Stein auf dem städtischen Hauptplatz. Stellt einen Ritter, im Barock einen römischen Krieger mit aufrecht gehaltenem Schwert dar. Vermutlich Symbol der städtischen Gerechtsame. [Koch 2009]
definition: Rolandův sloup, dřevěná nebo kamenná socha umístěná na hlavním náměstí města, rozšířená od 14. do 18. stol. v oblastech mezi řekou Vezerou a Prahou, na jihu až k Dubrovníku; představuje rytíře, v baroku římského vojáka s taseným mečem, patrně symbol městských privilegií. [Koch 2008] @cs
type: Concept
created: 2020-08-11T14:27:02
preferred label: roland @cs
in scheme: Strukturtypen
in scheme: Quellennachweis Koch 2008
in scheme: Quellennachweis Koch 2009
in scheme: Bamberger Vokabular für Historische Architektur
alternative label: Roland
modified: 2020-09-05T18:37:02
broader: Bildsäule

Strukturtypen
type: NamedIndividual
type: ConceptScheme

Quellennachweis Koch 2008
type: NamedIndividual
type: ConceptScheme

Quellennachweis Koch 2009
type: NamedIndividual
type: ConceptScheme

Bamberger Vokabular für Historische Architektur
type: NamedIndividual
type: ConceptScheme