Quellennachweis Koch 2009
type: NamedIndividual
type: ConceptScheme

Quellennachweis Koepf / Binding 2016
type: NamedIndividual
type: ConceptScheme

Strukturtypen
type: NamedIndividual
type: ConceptScheme

Domkapitel
type: NamedIndividual
type: Concept
related: Dom

Strukturtypen für Sakralbauten
type: NamedIndividual
type: ConceptScheme

Ordinarius liber
type: NamedIndividual
preferred label: ordo officiorum @la
preferred label: ordinarius liber @fr
preferred label: liber ordinarius @cs
type: Concept
related: Dom

Kirche
type: NamedIndividual
preferred label: kostel @cs
type: Concept
narrower: Dom

Bamberger Vokabular für Historische Architektur
type: NamedIndividual
type: ConceptScheme

Dom
type: NamedIndividual
in scheme: Strukturtypen
in scheme: Quellennachweis Koepf / Binding 2016
in scheme: Bamberger Vokabular für Historische Architektur
in scheme: Quellennachweis Koch 2009
in scheme: Strukturtypen für Sakralbauten
definition: Kathedrale, Bischofskirche einer Stadt, in Norddeutschland Dom, in Süddeutschland Münster genannt. [Koch 2009]
definition: Dom (lat. domus), im 6./7. Jh. das Wohn- und Verwaltungshaus des Bischofs (domus episcopalis), davon auf das collegium canonicorum, das Domkapitel, übertragen; im 12./13. Jh. setzten die Kanoniker ihrem Namen de domo zu; so meint Dom eigentl. das Stiftskapitel, nicht den Bischof; heute werden allg. Bischofskirchen als Dome bezeichnet, in Süddeutschland Münster, in Frankreich Kathedrale genannt. [Koepf / Binding 2016]
definition: Dom (lat. domus Dei = Haus Gottes), Bischofskirche, in Deutschland auch Hauptkirche einer Stadt ohne Bischof. In Süddeutschland auch Münster genannt. [Koch 2009]
definition: Bischofskirche, Hauptkirche am Sitz eines Bischofs. Die B. wird nach dem in ihr stehenden Bischofsstuhl (gr. kathedra) in Frankreich, Spanien und England meist Kathedrale genannt, während in Deutschland die Bezeichnungen Dom oder Münster üblicher sind. [Koepf / Binding 2016]
related: Ordinarius liber
related: Domkapitel
type: Concept
broader: Kirche
created: 2019-02-18T21:14:14
alternative label: Kathedrale
alternative label: Bischofskirche
broader by function: Kirche
modified: 2021-01-19T15:04:46