Quellennachweis Koch 2009
type: NamedIndividual
type: ConceptScheme

Mauerziegel
type: NamedIndividual
preferred label: tuile @fr
preferred label: teja @es
preferred label: tegola @it
preferred label: brick @en
type: Concept
broader: Ziegel

Quellennachweis Koepf / Binding 2016
type: NamedIndividual
type: ConceptScheme

Abbruchziegel
type: NamedIndividual
type: Concept
broader: Ziegel

Formstein
type: NamedIndividual
preferred label: tvarovka @cs
type: Concept
broader: Ziegel

Strukturtypen
type: NamedIndividual
type: ConceptScheme

Ziegel
type: Concept
in scheme: Bamberger Vokabular für Historische Architektur
in scheme: Quellennachweis Koepf / Binding 2016
in scheme: Quellennachweis Koch 2009
in scheme: Strukturtypen
preferred label: cihla @cs
created: 2019-05-07T14:22:43
type: NamedIndividual
definition: Cihla z jílu nebo hlíny, tvrzená proti meteorologickým vlivům (pále­ná). [Koch 2008] @cs
definition: Altes Mauerziegelformat, z.B. als Holsteiner Acht-Zoll-Format 190 x 90 x 40 mm. [Schrader / Voigt 2003]
definition: Ziegelstein, Ziegel, aus Ton oder Lehm wetterfest gehärtet (gebrannt). [Koch 2009]
definition: Backstein, (lat. later), aus Ton oder Lehm geformter Baustein, der im Unterschied zum luftgetrockneten B. durch Brennen gehärtet und wetterfest gemacht ist, meist längsrechteckiges Format, dessen Größe sich aus den jeweiligen techn. Gegebenheiten und aus traditionellen Verfahren in den Verbreitungsgebieten ergibt. Die Farbe hängt von der chem. Zusammensetzung des Rohmaterials und von der Brenntemperatur ab, auch farbige Glasuren sind möglich. Zur Verbindung von Backsteinen zu Mauern s. Mauerwerk, zur Verwendung als Dachdeckung s. Ziegel. [Koepf / Binding 2016]
broader: Kunststein
broader: Stein
narrower: Mauerziegel
narrower: Abbruchziegel
narrower: Formstein
narrower: Dachziegel
modified: 2021-03-19T20:07:29
editorial note: Bitte Begriffe für "Ziegel" (Dachziegel) und "Backstein" genau umgekehrt verwenden - hier auch die narrower nachführen (TAR)
alternative label: Backstein

Bamberger Vokabular für Historische Architektur
type: NamedIndividual
type: ConceptScheme

Kunststein
type: NamedIndividual
type: Concept
narrower: Ziegel

Stein
type: NamedIndividual
preferred label: kámen @cs
type: Concept
narrower: Ziegel

Dachziegel
type: NamedIndividual
preferred label: střešní taška @cs
type: Concept
broader: Ziegel