Begriffe für Naturstein- und Wandmalereirestaurierung
type: NamedIndividual
type: ConceptScheme

Quellennachweis ICOMOS-ISCS
type: NamedIndividual
type: ConceptScheme

Begriffe für den Themenkomplex Sakralbau
type: NamedIndividual
type: ConceptScheme

Begriffe für Bauerhalt
type: NamedIndividual
type: ConceptScheme

mechanischer Schaden
type: NamedIndividual
preferred label: mechanické poškození @cs
preferred label: mechanical damage @en
preferred label: dégât mécanique @fr
type: Concept
narrower: Stoßschaden

Stoßschaden
type: NamedIndividual
alternative label: ztráta materiálu @cs
alternative label: Einschlag
type: Concept
in scheme: Quellennachweis ICOMOS-ISCS
in scheme: Begriffe für den Themenkomplex Sakralbau
in scheme: Bamberger Vokabular für Historische Architektur
in scheme: Begriffe für Naturstein- und Wandmalereirestaurierung
in scheme: Begriffe für Bauerhalt
preferred label: impact damage @en
preferred label: trace d’impact @fr
preferred label: poškození nárazem @cs
modified: 2021-01-30T17:31:10
created: 2019-05-20T16:23:25
definition: Der Verlust von Steinmaterialdurch eine äußere mechanische Krafteinwirkung, welche dieGestalt eines Kraters haben kann, wenn der Gegenstand, derdie Gesteinsoberfläche trifft, hart und klein ist, z. B. ein Geschoss oder durch ein hartes Werkzeug. [ICOMOS-ISCS]
definition: Mechanical damage due to the impactof a projectile (bullet, shrapnel) or of a hard tool. [ICOMOS-ISCS] @en
definition: Dégât mécanique dû à l’impact d’un projectile(balle, éclat d’obus etc.) ou d’un outil dur. [ICOMOS-ISCS] @fr
definition: Kamene, způsobená mechanickým účinkemnárazu, která může mít také tvar „kráteru”, pokud jepředmět, který kamenný povrch zasáhl malý a tvrdý, např.projektil. [ICOMOS-ISCS] @cs
broader: mechanischer Schaden

Bamberger Vokabular für Historische Architektur
type: NamedIndividual
type: ConceptScheme