Blockzargenrahmen (Fenster)
type: NamedIndividual
definition: Fenstertyp (im Fachwerkbau), bei dem die Rahmenhölzer das gleiche Tiefenmaß der anliegenden Fachwerkwand haben, jedoch Pfosten und Kämpfer deutlich zierlicher sein können. [Pax - Fenster & Türen Fachbegriffe]
definition: Variante von einem Fensterrahmen und Türrahmen. Entwicklungsgeschichtlich eine Zwischenform zwischen Blockrahmen und Zargenrahmen, der sich vom konstruktiven Fachwerkgerüst getrennt hat und bei dem die einzelnen Hölzer differenzierte Querschnitte bekommen. Die Blockzarge wird in die lichte Maueröffnung gesetzt und sie ist tiefer als breit, im Gegensatz zum Blendrahmen, der breiter als tief ist. Vorteile sind beim Fenster geringerer Holzverbrauch und größere Lichtausbeute. [Schrader / Voigt 2003]
in scheme: Quellennachweis Pax - Fenster & Türen Fachbegriffe
in scheme: Quellennachweis Schrader / Voigt 2003
in scheme: Strukturtypen
in scheme: Bamberger Vokabular für Historische Architektur
modified: 2020-09-29T15:00:48
created: 2019-05-23T08:02:16
type: Concept
broader: Fensterrahmen

Quellennachweis Pax - Fenster & Türen Fachbegriffe
type: NamedIndividual
type: ConceptScheme

Quellennachweis Schrader / Voigt 2003
type: NamedIndividual
type: ConceptScheme

Strukturtypen
type: NamedIndividual
type: ConceptScheme

Bamberger Vokabular für Historische Architektur
type: NamedIndividual
type: ConceptScheme

Fensterrahmen
type: NamedIndividual
type: Concept
narrower: Blockzargenrahmen (Fenster)