Quellennachweis Koch 2009
type: NamedIndividual
type: ConceptScheme

Quellennachweis Koepf / Binding 2016
type: NamedIndividual
type: ConceptScheme

Strukturtypen
type: NamedIndividual
type: ConceptScheme

Kaffgesims
type: Concept
type: NamedIndividual
preferred label: cant @en
preferred label: parapetní římsa @cs
preferred label: rejet d\'eau @fr
preferred label: moldura de la ventana de medio punto @es
preferred label: cornice-gocciolatoio intermedia @it
definition: Kaffgesims, ein unterschnittenes Gesims mit Wassernase und Hohlkehle zur Wasserabweisung an Bauwerken. Der W. kommt bes. häufig in der Gotik als Gesims in der Höhe der Fenstersohlbank (Gesimsformen) und an den Vorsprüngen von Strebepfeilern vor. [Koepf / Binding 2016]
definition: Kaffgesims, Kaffsims; Gesims an einem Absatz, der Kaffung, besonders an got. Strebepfeilern, aber auch als Stock- oder Sohlbankgesims, das die Mauer horizontal gliedert (Gurtgesims) und über den Strebepfeilern verkröpft ist. [Koepf / Binding 2016]
definition: Kaff-, Kapp-Gesims (Gotik), abgeschrägtes (gekapptes) Gesims, läuft unter den Fenstern hin und wird um die Strebepfeiler herumgekröpft. [Koch 2009]
definition: Zkosená (okosená) římsa, probíhá pod okny a lomí se kolem opěrných pilířů. [Koch 2008] @cs
alternative label: Wasserschlag
alternative label: coupe-larmes @fr
alternative label: weathering @en
alternative label: ráz vody @cs
alternative label: Kappgesims
alternative label: oblique cornice @en
alternative label: Schräggesims
alternative label: bankálová římsa @cs
alternative label: moldura oblicua @es
alternative label: hydraulický ráz @cs
alternative label: cornice a spiovente @it
in scheme: Quellennachweis Koch 2009
in scheme: Quellennachweis Koch 2008
in scheme: Quellennachweis Koepf / Binding 2016
in scheme: Bamberger Vokabular für Historische Architektur
in scheme: Strukturtypen
created: 2020-01-21T16:16:55
broader: Gesims
modified: 2021-01-25T12:18:13

Quellennachweis Koch 2008
type: NamedIndividual
type: ConceptScheme

Bamberger Vokabular für Historische Architektur
type: NamedIndividual
type: ConceptScheme

Gesims
type: NamedIndividual
preferred label: římsa @cs
type: Concept
narrower: Kaffgesims