Quellennachweis Koch 2009
type: NamedIndividual
type: ConceptScheme

Quellennachweis Koepf / Binding 2016
type: NamedIndividual
type: ConceptScheme

Platz
type: NamedIndividual
preferred label: place @fr
preferred label: piazza @it
preferred label: plaza @es
type: Concept
narrower: Agora

Agora
type: NamedIndividual
preferred label: agora @cs
in scheme: Quellennachweis Koepf / Binding 2016
in scheme: Quellennachweis Koch 2009
in scheme: Bamberger Vokabular für Historische Architektur
in scheme: Strukturtypen
in scheme: Strukturtypen für Wohn- und Nutzbauten
in scheme: Quellennachweis Koch 2008
type: Concept
definition: Agora (gr. Markt), Platz der gr. Stadt, auf dem Versammlungen und Märkte abgehalten wurden, meist rechteckig und von Säulenhallen (Stoa) umgeben, mit einem oder mehreren Altären und mit Denkmälern. An oder in der Nähe der A. lagen das Rathaus (Buleuterion) und das Haus der städt. Behörden (Prytaneion). [Koepf / Binding 2016]
definition: AGORA (řec. trh), náměstí řeckého města sloužící různým účelům. [Koch 2008] @cs
definition: Agora (griech. Markt), Platz der griechischen Stadt mit vielfältigen Aufgaben. [Koch 2009]
created: 2020-08-03T09:38:17
broader: Platz
modified: 2021-01-27T01:04:02

Bamberger Vokabular für Historische Architektur
type: NamedIndividual
type: ConceptScheme

Strukturtypen
type: NamedIndividual
type: ConceptScheme

Strukturtypen für Wohn- und Nutzbauten
type: NamedIndividual
type: ConceptScheme

Quellennachweis Koch 2008
type: NamedIndividual
type: ConceptScheme