Attische Basis
type: NamedIndividual
preferred label: atická patka @cs
type: Concept
broader: Basis

Quellennachweis Koepf / Binding 2016
type: NamedIndividual
type: ConceptScheme

Strukturtypen
type: NamedIndividual
type: ConceptScheme

Säulenelement
type: NamedIndividual
preferred label: část sloupu @cs
type: Concept
narrower: Basis

Basis
type: Concept
broader: Säulenelement
broader: Pfeilerelement
created: 2019-05-14T12:57:07
preferred label: patka @cs
preferred label: base @it
alternative label: sloupová patka @cs
alternative label: base d\'un pilier (pilier) @fr
alternative label: pier base (pier) @en
alternative label: pata sloupu @cs
alternative label: Pfeilerbasis (Pfeiler)
alternative label: Säulenbasis (Säule)
alternative label: column base (column) @en
alternative label: patka sloupu @cs
alternative label: Säulenfuß
alternative label: base de la colonne @fr
type: NamedIndividual
in scheme: Strukturtypen
in scheme: Quellennachweis Koch 2008
in scheme: Quellennachweis Koepf / Binding 2016
in scheme: Bamberger Vokabular für Historische Architektur
definition: Der ausladende Fuß eines Pfeilers, meist mit Wulst (Torus) und Kehle (Trochilus) profiliert, auf einer eckigen Unterlagsplatte (PIinthe). [Glossarium Artis]
definition: Basis (gr. Schritt, Fuß; Mz.: Basen), der ausladende Fuß einer Säule oder eines Pfeilers. Die B. verteilt den Druck der Stütze auf eine größere Fläche und leitet zur Fußplatte (Plinthe) über. Der Übergang von der Senkrechten zur Waagerechten wird durch Profilierung der B. mit den einfachen Elementen Wulst (Torus) und Kehle (Trochilus) ästhetisch gemildert, wie sie die attische B. in weithin vorbildl. gewordener Form aufweist. Während schon die ägypt. Säulen des Alten Reiches ebenso ebenso wie die kret. teilweise eine B. besitzen, fehlt sie bei der dor. Säule grundsätzlich. Eine Sonderform innerhalb des gr. Kulturbereichs entwickelte die kleinasiat. Ionische Ordnung. In der Antike und in roman. Zeit wurde vornehmlich die att. B. verwendet, seit 1100 mit Eckzier als kleine Nasen, Sporne, Knollen, Blätter, Köpfchen, Klauen oder geometr. Formen. Mit Aufkommen der Gotik wird die B. niedriger und steht über die Plinthe vor (Tellerb.). Seit dem 16. Jh. werden die antiken B.formen wiederaufgenommen. [Koepf / Binding 2016]
definition: Säulen- oder Pfeilerfuß.
definition: 1. Patka sloupu, nebo pilíře. 2. Vystupující opěrná deska mezi podporou (zeď, pilíř, sloup, hlavice) a obloukem nebo klenbou. [Koch 2008] @cs
modified: 2021-01-22T16:37:38
narrower: Attische Basis

Pfeilerelement
type: NamedIndividual
preferred label: část pilíře @cs
type: Concept
narrower: Basis

Quellennachweis Koch 2008
type: NamedIndividual
type: ConceptScheme

Bamberger Vokabular für Historische Architektur
type: NamedIndividual
type: ConceptScheme