Quellennachweis Koch 2009
type: NamedIndividual
type: ConceptScheme

Quellennachweis Koepf / Binding 2016
type: NamedIndividual
type: ConceptScheme

Barock
type: NamedIndividual
preferred label: baroko @cs
type: Concept
related: Chinoiserie
narrower: Chinoiserie

Begriffe für den Themenkomplex Sakralbau
type: NamedIndividual
type: ConceptScheme

Chinoiserie
type: Concept
created: 2020-08-04T09:19:11
related: Rokoko
related: Barock
broader: Barock
broader: Rokoko
broader: Dekorationsstil
type: NamedIndividual
in scheme: Begriffe für den Themenkomplex Sakralbau
in scheme: Quellennachweis Koch 2009
in scheme: Quellennachweis Koch 2008
in scheme: Quellennachweis Koepf / Binding 2016
in scheme: Bamberger Vokabular für Historische Architektur
preferred label: chinoiserie @cs
definition: Napodobení východoasijských dekoračních a architektonických prvků v evropské architektuře 17. a 18. stol. [Koch 2008] @cs
definition: Nachahmung ostasiatischer Dekorations- und Bauformen in der europäischen Architektur des 17. und 18. Jhs. [Koch 2009]
definition: Chinoiserie (frz.), Bezeichnung für die Übernahme bzw. Nachahmung chines. oder überhaupt ostasiat. Formen durch die europ. Baukunst und Innenarchitektur des 17. und 18. Jhs. Chines. Zimmer mit chines. Lackmalerei und Seidenstickerei gibt es in den meisten Residenzen des Barock und des Rokoko, auch in Gärten und Parks wurden Pavillons und Pagoden in chines. Stil errichtet, bei denen man bes. die chines. Dachform nachbildete. [Koepf / Binding 2016]
modified: 2021-01-15T18:27:02

Dekorationsstil
type: NamedIndividual
type: Concept
narrower: Chinoiserie

Quellennachweis Koch 2008
type: NamedIndividual
type: ConceptScheme

Bamberger Vokabular für Historische Architektur
type: NamedIndividual
type: ConceptScheme

Rokoko
type: NamedIndividual
preferred label: rokoko @cs
type: Concept
related: Chinoiserie
narrower: Chinoiserie