Quellennachweis Koch 2009
type: NamedIndividual
type: ConceptScheme

Stabkirche
type: NamedIndividual
preferred label: sloupkový kostel @cs
preferred label: iglesia escandinava empalizada @es
preferred label: stave church @en
preferred label: stavkirke @fr
preferred label: chiesa lignea norvegese @it
in scheme: Bamberger Vokabular für Historische Architektur
in scheme: Strukturtypen für Sakralbauten
in scheme: Strukturtypen
in scheme: Quellennachweis Koch 2009
in scheme: Quellennachweis Koch 2008
created: 2020-08-06T12:42:05
broader: Kirche
definition: Z norštiny stavkirke. Skandinávský dřevěný kostel, patrně na základě nordické královské haly. Podle způsobu stavby stěn ze svislých sloupků a fošen zvaný též sloupkový kostel s vnitřními podporami. [Koch 2008] @cs
definition: Skandinavische Holzkirche, vermutlich eine Nachform der nordischen Königshalle. Nach der Bauweise der Wände aus senkrechten, mastenähnlichen Pfosten und Planken auch Mastenkirche genannt. Stufige Dächer. [Koch 2009]
definition: Skandinav. Holzkirche, deren konstruktives Gerüst aus Masten besteht (Stabbau). Der Innenraum ist relativ klein und durch die Masten verstellt. [Koepf / Binding 2016]
alternative label: sloupkový kostel s vnitřními podporami @cs
alternative label: Mastenkirche
type: Concept
modified: 2021-01-19T15:11:02

Bamberger Vokabular für Historische Architektur
type: NamedIndividual
type: ConceptScheme

Strukturtypen für Sakralbauten
type: NamedIndividual
type: ConceptScheme

Strukturtypen
type: NamedIndividual
type: ConceptScheme

Quellennachweis Koch 2008
type: NamedIndividual
type: ConceptScheme

Kirche
type: NamedIndividual
preferred label: kostel @cs
type: Concept
narrower: Stabkirche