Quellennachweis Koch 2009
type: NamedIndividual
type: ConceptScheme

Bogen
type: NamedIndividual
preferred label: oblouk @cs
preferred label: arch @en
preferred label: arc @fr
type: Concept
narrower: Schildbogen

Schildbogen
type: NamedIndividual
preferred label: formeret @en
preferred label: arco en nicho @es
preferred label: čelní oblouk @cs
preferred label: arc formeret @fr
preferred label: arco laterale @it
in scheme: Strukturtypen
in scheme: Quellennachweis Koch 2009
in scheme: Quellennachweis Glossarium Artis
in scheme: Bamberger Vokabular für Historische Architektur
broader: Bogen
created: 2019-02-18T20:09:58
alternative label: čelní pás (klenby) @cs
alternative label: Schildgurt
alternative label: wall rib @en
alternative label: čelo klenby @cs
alternative label: arco perimetrale @it
alternative label: wall arch @en
broader by position: Bogen
definition: Im Anlauf eines Kreuz- oder Tonnengewölbes auf eine Wand entstehender Bogen. [Glossarium Artis]
definition: Der Bogen am Anschluss eines Gewölbes an die Mauer (Schildwand). [Koepf /Binding 2016]
definition: Der Bogen, der sich bei der Verschneidung von Gewölbe- und Wandfläche bildet, begrenzt das Joch seitlich und ist häufig durch einen Längsgurt oder eine Schildrippe markiert. [Koch 2009]
definition: Oblouk, který vznikne rozříznutím plochy klenby a stěny, vymezuje klenební pole po straně a bývá. často vyznačen podélným pásem nebo čelním žebrem. [Koch 2008] @cs
type: Concept
modified: 2020-11-27T09:20:49

Strukturtypen
type: NamedIndividual
type: ConceptScheme

Quellennachweis Glossarium Artis
type: NamedIndividual
type: ConceptScheme

Bamberger Vokabular für Historische Architektur
type: NamedIndividual
type: ConceptScheme