Altarretabelelement
type: NamedIndividual
type: Concept
narrower: Gesprenge

Gesprenge
type: NamedIndividual
type: Concept
scope note: Reich geschnitzter hölzerner Aufsatz aus Wimpergen, Maßwerk, Blattwerk, Krabben, Fialen und Kreuzblumen seitlich und über den Retabelflügeln, manchmal mit Figurenschmuck. [Koch 2009]
scope note: Pozdně gotické skříně nesly oltářní nástavec. Ozdobný průhledný systém tenkých tyčí, fiál osazených kraby a rovněž konzolových figur pod baldachýny. [Koch 2008] @cs
in scheme: Strukturtypen
in scheme: Quellennachweis Koch 2008
in scheme: Strukturtypen für Sakralbauten
in scheme: Quellennachweis Koepf / Binding 2016
in scheme: Bamberger Vokabular für Historische Architektur
modified: 2021-01-31T00:05:27
preferred label: oltářní nástavec @cs
broader: Altarretabelelement
alternative label: Auszug
definition: Feingliedriger, holzgeschnitzter Aufbau aus Baldachinen, Fialen und Laubwerk über dem Retabel eines Flügelaltars. Das G. ist charakterist. für spätgot. Altarschreine und übertrifft in vielen Fällen den Altarschrein an Höhe. Oft sind auch Skulpturen im G. zu finden. [Koepf / Binding 2016]
created: 2020-01-10T17:51:18

Strukturtypen
type: NamedIndividual
type: ConceptScheme

Quellennachweis Koch 2008
type: NamedIndividual
type: ConceptScheme

Strukturtypen für Sakralbauten
type: NamedIndividual
type: ConceptScheme

Quellennachweis Koepf / Binding 2016
type: NamedIndividual
type: ConceptScheme

Bamberger Vokabular für Historische Architektur
type: NamedIndividual
type: ConceptScheme