Zwickel (räumlich)
type: Concept
preferred label: spandrel (vault) @en
preferred label: pennacchio @it
preferred label: pechina @es
preferred label: écoinçon (voûte) @fr
preferred label: cvikl (prostorově) @cs
definition: Trojúhelníková, většinou na špici stojící plocha mezi dvěma divergujícími obloukovými liniemi. [Koch 2008] @cs
definition: 1. die dreieckige, meist auf einer Spitze stehende Fläche zwischen zwei divergierenden Bogenlinien ( = Bogenzwickel) oder zwischen Bogen und rechtwinkliger Einfassung (= Spandrille); 2. Hängezwickel bzw. Pendentifs (Kuppel). [Koch 2009]
definition: Eckz., Teilgewölbe (Trompe), das zu einer Kuppel oder zu einem Klostergewölbe überleitet. Ein Z. in Form eines sphär. Dreiecks ist der Pendentif. [Koepf/Binding 2016]
definition: Der Zwischenraum zwischen dem Gewölberücken und dem aufgehenden Mauerwerk über dem Widerlager. [Glossarium Artis]
alternative label: gore @en
alternative label: cíp @cs
alternative label: clef de voûte @fr
alternative label: lune @en
alternative label: pendentiv @cs
in scheme: Bamberger Vokabular für Historische Architektur
in scheme: Strukturtypen
in scheme: Quellennachweis Glossarium Artis
in scheme: Quellennachweis Koch 2008
type: NamedIndividual
narrower: Gewölbezwickel
broader: Gewölbeelement
modified: 2020-12-01T14:46:56
created: 2020-02-18T14:49:32

Bamberger Vokabular für Historische Architektur
type: NamedIndividual
type: ConceptScheme

Strukturtypen
type: NamedIndividual
type: ConceptScheme

Quellennachweis Glossarium Artis
type: NamedIndividual
type: ConceptScheme

Quellennachweis Koch 2008
type: NamedIndividual
type: ConceptScheme

Gewölbezwickel
type: NamedIndividual
type: Concept
broader: Zwickel (räumlich)

Gewölbeelement
type: NamedIndividual
preferred label: část klenby @cs
type: Concept
narrower: Zwickel (räumlich)