Quellennachweis Koch 2009
type: NamedIndividual
type: ConceptScheme

Altarretabelelement
type: NamedIndividual
type: Concept
narrower: Predella

Predella
type: NamedIndividual
preferred label: prédelle @fr
preferred label: predella @it
preferred label: predela @es
in scheme: Quellennachweis Koch 2009
in scheme: Strukturtypen
in scheme: Quellennachweis Koch 2008
in scheme: Bamberger Vokabular für Historische Architektur
in scheme: Quellennachweis Koepf / Binding 2016
in scheme: Strukturtypen für Sakralbauten
scope note: Predella, Zwischenstück zwischen Mensa und Altarretabel (Flügelaltar). [Koepf / Binding 2016]
scope note: Oltářní stupeň na mense jako hranolový podstavec retabula nebo skříně křídlového oltáře. [Koch 2008] @cs
scope note: Altarstaffel, der auf der Mensa aufsitzende Sockel eines Altarretabels oder des Schreins eines Flügelaltars, meist mit Malereien oder Bildwerken geschmückt oder als Reliquienbehälter. [Koepf/Binding 2016]
scope note: Altarstaffel auf der Mensa als Unterbau für ein Retabel oder für den Schrein eines Flügelaltars. [Koch 2009]
type: Concept
modified: 2021-01-31T00:05:45
alternative label: Altarstaffel
created: 2020-01-10T17:49:51
broader: Altarretabelelement

Strukturtypen
type: NamedIndividual
type: ConceptScheme

Quellennachweis Koch 2008
type: NamedIndividual
type: ConceptScheme

Bamberger Vokabular für Historische Architektur
type: NamedIndividual
type: ConceptScheme

Quellennachweis Koepf / Binding 2016
type: NamedIndividual
type: ConceptScheme

Strukturtypen für Sakralbauten
type: NamedIndividual
type: ConceptScheme