Begriffe für den Themenkomplex Sakralbau
type: NamedIndividual
type: ConceptScheme

Quellennachweis EwaGlos
type: NamedIndividual
type: ConceptScheme

Markierung durch Schlagschnur
type: Concept
in scheme: Bamberger Vokabular für Historische Architektur
in scheme: Begriffe für den Themenkomplex Sakralbau
in scheme: Quellennachweis EwaGlos
alternative label: Markierung mit Schlagleine
alternative label: Schnurschlag
alternative label: snapped cord @en
alternative label: chalk line @en
created: 2019-10-15T11:06:05
type: NamedIndividual
definition: A method of applying a straight line on plaster (can be coloured or without colour) by stretching a piece of string, pulling back and releasing it so that it snaps against the painting, leaving a mark. [EwaGlos] @en
definition: Eine Methode, gerade Linien auf Putzmörtel aufzubringen (kann farbig oder farblos sein), indem eine Schnur gespannt, leicht abgehoben und wieder losgelassen wird, sodass sie auf den Putz zurückschnellt und dabei eine Spur hinterlässt. [EwaGlos]
preferred label: snapped line @en
modified: 2021-01-18T14:03:38
broader: Kunst- und Handwerkstechnik

Bamberger Vokabular für Historische Architektur
type: NamedIndividual
type: ConceptScheme

Kunst- und Handwerkstechnik
type: NamedIndividual
preferred label: řemeslo @cs
type: Concept
narrower: Markierung durch Schlagschnur