Quellennachweis Koch 2009
type: NamedIndividual
type: ConceptScheme

Maschikulis
type: Concept
alternative label: moucharaby @fr
alternative label: machicolation @en
alternative label: mâchicoulis @fr
type: NamedIndividual
preferred label: matacán @it
preferred label: mašikuli @cs
preferred label: assommoir @fr
created: 2020-06-23T10:35:05
broader: Wehrelement
in scheme: Bamberger Vokabular für Historische Architektur
in scheme: Strukturtypen
in scheme: Quellennachweis Koch 2009
definition: f (Machikouli, frz.), Wurfschachtreihen, teils synonym zu Wehrerker/Pechnase verwendet. M.s dienten zur Vertikalverteidigung, d. h. zur Bekämpfung von Angreifern von oben (Stadtbefestigung Rhódos GR: Thalassintor). Meist gab es M.s über Toren (Líndos / Insel Rhódos GR) oder besonders gefährdeten Stellen, in Deutschland jedoch nur selten (Burg Boppard RP: Wohnturm). In Griechenland erschienen im Spätmittelalter Übergangsformen zwischen M. und Pechnasen (Mandráki / Insel Nísyros, Burg). In (früh-)neuzeitlichen Festungen fanden M.s nur noch vereinzelt Anwendung (Marienburg/Würzburg BY: M.-Turm nach Entwurf von Balthasar Neumann), denn nach Verbreitung der Feuerwaffen wurde senkrechtes Mauerwerk wegen seiner Gefährdung gegen Beschuss möglichst vermieden. M. L. [Wörterbuch der Burgen, Schlösser und Festungen]
definition: Maschikulis (Pluraletantum, frz.), Gussöffnungen am Wehrgang einer Burg. [Koch 2009]
modified: 2021-01-25T13:01:28
broader by function: Wehrelement

Bamberger Vokabular für Historische Architektur
type: NamedIndividual
type: ConceptScheme

Strukturtypen
type: NamedIndividual
type: ConceptScheme

Wehrelement
type: NamedIndividual
type: Concept
narrower: Maschikulis