Quellennachweis Koch 2009
type: NamedIndividual
type: ConceptScheme

Steinzeug
type: Concept
modified: 2020-11-02T16:54:04
preferred label: terracotta @it
preferred label: kamenina @cs
preferred label: stoneware @en
preferred label: gres @es
preferred label: grès (-cérame) @fr
in scheme: Quellennachweis Koch 2009
in scheme: Bamberger Vokabular für Historische Architektur
definition: Sinterzeug mit bes. harten Scherben aus geschmolzenem Ton, das hauptsächl. für Fliesen und Kanalisationsrohre verwandt wird. [Koepf / Binding 2016]
definition: Seine glänzende Glasur entsteht durch Verdampfen von Salz während des Brennens bei hoher Temperatur. Wenige Farben: Kobalt, Manganviolett; Braun durch Raucheinwirkung in den Brennraum (Schmauchung). (Ostasien; Köln, Kannebäckerland). [Koch 2009]
definition: Její lesklá glazura vzniká vypařováním soli při vypalování za vysoké teploty. Méně barev: kobalt, manganová fialka; hnědá barva působením kouře ve vypalovacím prostoru (přesoušení), (východní Asie; v Německu Kolín nad Rýnem, oblast Kannebackerland v Porýní). [Koch 2008] @cs
alternative label: crockery @en
alternative label: Sinterzeug
broader: Keramik
type: NamedIndividual
created: 2020-08-06T10:29:25

Bamberger Vokabular für Historische Architektur
type: NamedIndividual
type: ConceptScheme

Keramik
type: NamedIndividual
preferred label: keramika @cs
preferred label: ceramic @en
type: Concept
narrower: Steinzeug