Quellennachweis Koch 2009
type: NamedIndividual
type: ConceptScheme

Tumulus
type: Concept
in scheme: Quellennachweis Koch 2009
in scheme: Quellennachweis Koch 2008
in scheme: Quellennachweis Koepf / Binding 2016
in scheme: Strukturtypen
in scheme: Bamberger Vokabular für Historische Architektur
preferred label: tumulo @it
preferred label: túmulo @es
preferred label: tumulus @fr
definition: Mohyla s kruhovým půdorysem, zvl. v mykénské, pergamské, etruské a římské kultuře, Augustovo mauzoleum. [Koch 2008] @cs
definition: Grabhügel auf kreisrundem Grundriss. Die Grundform des T. kommt hauptsächl. bei myken. Gräbern, Grabhügeln in der Gegend von Pergamon, bei etrusk. und röm. Gräbern vor. [Koepf / Binding 2016]
definition: Grabhügel mit kreisförmigem Grundriss, besonders in der mykenischen, pergamenischen, etruskischen, römischen Kultur. [Koch 2009]
type: NamedIndividual
broader: Begräbnisstätte
modified: 2021-01-12T17:05:09
created: 2020-08-05T18:11:40

Quellennachweis Koch 2008
type: NamedIndividual
type: ConceptScheme

Quellennachweis Koepf / Binding 2016
type: NamedIndividual
type: ConceptScheme

Strukturtypen
type: NamedIndividual
type: ConceptScheme

Bamberger Vokabular für Historische Architektur
type: NamedIndividual
type: ConceptScheme

Begräbnisstätte
type: NamedIndividual
preferred label: hrob @cs
type: Concept
narrower: Tumulus