Darstellungsinhalt
type: NamedIndividual
type: Concept
narrower: Putto

Putto
type: NamedIndividual
type: Concept
definition: Putte (it. putto = kleines Kind, Mz. putti), nackte kleine Knaben mit oder ohne Flügel, sind eine Umformung der gotischen Kinderengel und bevölkern seit der Frührenaissance, besonders aber im Barock Altäre, Bilder, Orgeln, Wände, Decken und Galerien der Kirchen. Ihre Tätigkeiten sind meist symbolische Wiederholungen des Hauptthemas, dem sie beigesellt sind. [Koch 2009]
definition: Nazí chlapečkové s křídly nebo bez křídel. Putti vznikly přetvořením gotických andílků a od dob renesance, zvláště však baroka byly umisťovány na oltářích, obrazech, varhanách, stěnách, stropech a galeriích kostelů, Jejich činnost většinou symbolicky opakuje hlavní téma, k němuž jsou přidruženy. [Koch 2008] @cs
preferred label: Putti (mn. č.) @cs
broader: Darstellungsinhalt
alternative label: Putte
modified: 2021-01-27T10:28:10
in scheme: Quellennachweis Koch 2008
in scheme: Quellennachweis Koch 2009
in scheme: Bamberger Vokabular für Historische Architektur
created: 2020-08-03T14:39:04

Quellennachweis Koch 2008
type: NamedIndividual
type: ConceptScheme

Quellennachweis Koch 2009
type: NamedIndividual
type: ConceptScheme

Bamberger Vokabular für Historische Architektur
type: NamedIndividual
type: ConceptScheme