Begriffe für Naturstein- und Wandmalereirestaurierung
type: NamedIndividual
type: ConceptScheme

Quellennachweis ICOMOS-ISCS
type: NamedIndividual
type: ConceptScheme

Begriffe für Bauerhalt
type: NamedIndividual
type: ConceptScheme

Krakelee
type: NamedIndividual
type: Concept
scope note: Network of minor cracks also called crack network. The term crazing is not appropriate for stone, as this term should be used for describing the development of a crack network on glazed terracotta. [ICOMOS-ISCS] @en
scope note: Netzwerk aus kleinen Rissen, welche die Oberfläche überziehen. Der Begriff „Glasurrisse“ ist für Gesteine nicht geeignet, weil dieser Begriff nur benützt werden sollte, um die Bildung von Netzwerkrissen auf glasierter Terrakotta zu beschreiben. [ICOMOS-ISCS]
definition: auch Rissnetz genannt, ist ein Netzwerk von kleineren Rissen. [ICOMOS-ISCS]
definition: síť malých trhlin na povrchu kamene. [ICOMOS-ISCS] @cs
definition: Network of minor cracks also called crack network. The term crazing is not appropriate for stone, as thisterm should be used for describing the development of a cracknetwork on glazed terracotta. [ICOMOS-ISCS] @en
definition: Réseau de fissures peu ouvertes. Le termefaïençage n’est pas approprié pour la pierre : il décrit unréseau de fissures affectant un émail, un enduit. [ICOMOS-ISCS] @fr
in scheme: Bamberger Vokabular für Historische Architektur
in scheme: Begriffe für Naturstein- und Wandmalereirestaurierung
in scheme: Quellennachweis ICOMOS-ISCS
in scheme: Begriffe für Bauerhalt
created: 2019-05-08T17:23:46
alternative label: Craquelé
preferred label: krakelování @cs
preferred label: craquellement @fr
preferred label: craquele @en
broader: Riss
modified: 2021-01-30T17:36:41

Bamberger Vokabular für Historische Architektur
type: NamedIndividual
type: ConceptScheme

Riss
type: NamedIndividual
preferred label: trhlina @cs
preferred label: fissure @fr
preferred label: crack @en
type: Concept
narrower: Krakelee